BDBM50253200 CHEMBL493893::spathodic acid
SMILES: CC1(C)CC[C@@]2(CC[C@]3(C)C(=CC[C@@H]4[C@@]5(C)CC[C@H](O)[C@](C)(CO)[C@@H]5CC[C@@]34C)[C@@H]2[C@@H]1O)C(O)=O
InChI Key: InChIKey=TUOYZAJHBIXONX-CGSJAQJOSA-N
Data: 1 IC50
Activity Spreadsheet -- Enzyme Inhibition Constant Data from BindingDB
Found 1 hit for monomerid = 50253200
Trg + Lig
Ki
nM
ΔG°
kcal/mole
IC50
nM
Kd
nM
EC50/IC50
nM
koff
s-1
kon
M-1s-1
pHTemp
°C
Protein-tyrosine phosphatase 1B
(Homo sapiens (Human))
BDBM50253200
(CHEMBL493893 | spathodic acid)
Show SMILES CC1(C)CC[C@@]2(CC[C@]3(C)C(=CC[C@@H]4[C@@]5(C)CC[C@H](O)[C@](C)(CO)[C@@H]5CC[C@@]34C)[C@@H]2[C@@H]1O)C(O)=O |r,c:10|
Show InChI InChI=1S/C30H48O5/c1-25(2)13-15-30(24(34)35)16-14-28(5)18(22(30)23(25)33)7-8-20-26(3)11-10-21(32)27(4,17-31)19(26)9-12-29(20,28)6/h7,19-23,31-33H,8-17H2,1-6H3,(H,34,35)/t19-,20-,21+,22-,23+,26+,27-,28-,29-,30+/m1/s1
NCI pathway
Reactome pathway
n/an/a 1.88E+4n/an/an/an/an/an/a
Chosun University
Curated by ChEMBL
Assay Description
Inhibition of human recombinant PTP1B after 30 mins
J Nat Prod 71: 1775-8 (2008)
Article DOI: 10.1021/np800298w
BindingDB Entry DOI: 10.7270/Q2TQ62F7