BDBM50253424 CHEMBL495337::N4-Benzyl-N2-isobutyl-6-phenethyl-pyrimidine-2,4-diamine
SMILES: CC(C)CNc1nc(CCc2ccccc2)cc(NCc2ccccc2)n1
InChI Key: InChIKey=CRPOCJZOZPVALN-UHFFFAOYSA-N
Data: 2 KI  1 IC50
Activity Spreadsheet -- Enzyme Inhibition Constant Data from BindingDB
Found 3 hits for monomerid = 50253424
Trg + Lig
Ki
nM
ΔG°
kcal/mole
IC50
nM
Kd
nM
EC50/IC50
nM
koff
s-1
kon
M-1s-1
pHTemp
°C
Estrogen receptor
(Homo sapiens (Human))
BDBM50253424
(CHEMBL495337 | N4-Benzyl-N2-isobutyl-6-phenethyl-p...)
Show SMILES CC(C)CNc1nc(CCc2ccccc2)cc(NCc2ccccc2)n1
Show InChI InChI=1S/C23H28N4/c1-18(2)16-25-23-26-21(14-13-19-9-5-3-6-10-19)15-22(27-23)24-17-20-11-7-4-8-12-20/h3-12,15,18H,13-14,16-17H2,1-2H3,(H2,24,25,26,27)
1.70E+3n/an/an/an/an/an/an/an/a
University of Illinois at Urbana-Champaign
Curated by ChEMBL
Assay Description
Binding affinity to ERalpha (unknown origin) assessed as inhibition of fluorescein-labeled nuclear receptor domain of steroid receptor coactivator 3 ...
J Med Chem 51: 6512-30 (2008)
Article DOI: 10.1021/jm800698b
BindingDB Entry DOI: 10.7270/Q2KD1XRF
Estradiol receptor beta (ERβ)
(Homo sapiens (Human))
BDBM50253424
(CHEMBL495337 | N4-Benzyl-N2-isobutyl-6-phenethyl-p...)
Show SMILES CC(C)CNc1nc(CCc2ccccc2)cc(NCc2ccccc2)n1
Show InChI InChI=1S/C23H28N4/c1-18(2)16-25-23-26-21(14-13-19-9-5-3-6-10-19)15-22(27-23)24-17-20-11-7-4-8-12-20/h3-12,15,18H,13-14,16-17H2,1-2H3,(H2,24,25,26,27)
>1.00E+6n/an/an/an/an/an/an/an/a
University of Illinois at Urbana-Champaign
Curated by ChEMBL
Assay Description
Binding affinity to ERbeta (unknown origin) assessed as inhibition of fluorescein-labeled nuclear receptor domain of steroid receptor coactivator 3 b...
J Med Chem 51: 6512-30 (2008)
Article DOI: 10.1021/jm800698b
BindingDB Entry DOI: 10.7270/Q2KD1XRF
Estrogen receptor
(Homo sapiens (Human))
BDBM50253424
(CHEMBL495337 | N4-Benzyl-N2-isobutyl-6-phenethyl-p...)
Show SMILES CC(C)CNc1nc(CCc2ccccc2)cc(NCc2ccccc2)n1
Show InChI InChI=1S/C23H28N4/c1-18(2)16-25-23-26-21(14-13-19-9-5-3-6-10-19)15-22(27-23)24-17-20-11-7-4-8-12-20/h3-12,15,18H,13-14,16-17H2,1-2H3,(H2,24,25,26,27)
n/an/a 1.90E+3n/an/an/an/an/an/a
University of Illinois at Urbana-Champaign
Curated by ChEMBL
Assay Description
Antagonist activity at ERalpha in human HEC1 cells assessed as inhibition of estrogen-induced transcriptional activity after 24 hrs by reporter gene ...
J Med Chem 51: 6512-30 (2008)
Article DOI: 10.1021/jm800698b
BindingDB Entry DOI: 10.7270/Q2KD1XRF