BDBM50253488 (-)-(R)-Ethyl-[2-hydroxy-2-[2-methyl-5-(4-methylsulfonyl)phenyl-1-phenyl-1H-pyrrol-3-yl]]acetate::CHEMBL494904
SMILES: CCOC(=O)[C@H](O)c1cc(-c2ccc(cc2)S(C)(=O)=O)n(c1C)-c1ccccc1
InChI Key: InChIKey=DSEATYLBKDNYNP-OAQYLSRUSA-N
Data: 2 IC50
Activity Spreadsheet -- Enzyme Inhibition Constant Data from BindingDB
Found 2 hits for monomerid = 50253488
Trg + Lig
Ki
nM
ΔG°
kcal/mole
IC50
nM
Kd
nM
EC50/IC50
nM
koff
s-1
kon
M-1s-1
pHTemp
°C
Cyclooxygenase-2 (COX-2)
(Mus musculus (Mouse))
BDBM50253488
((-)-(R)-Ethyl-[2-hydroxy-2-[2-methyl-5-(4-methylsu...)
Show SMILES CCOC(=O)[C@H](O)c1cc(-c2ccc(cc2)S(C)(=O)=O)n(c1C)-c1ccccc1 |r|
Show InChI InChI=1S/C22H23NO5S/c1-4-28-22(25)21(24)19-14-20(16-10-12-18(13-11-16)29(3,26)27)23(15(19)2)17-8-6-5-7-9-17/h5-14,21,24H,4H2,1-3H3/t21-/m1/s1
n/an/a 150n/an/an/an/an/an/a
Università La Sapienza
Curated by ChEMBL
Assay Description
Inhibition of COX2 in LPS-stimulated mouse J774 cells assessed as inhibition of PGE2 production after 15 mins by radioimmunoassay
Bioorg Med Chem 16: 8072-81 (2008)
Article DOI: 10.1016/j.bmc.2008.07.058
BindingDB Entry DOI: 10.7270/Q24J0DZW
Prostaglandin G/H synthase (cyclooxygenase)
(Mus musculus)
BDBM50253488
((-)-(R)-Ethyl-[2-hydroxy-2-[2-methyl-5-(4-methylsu...)
Show SMILES CCOC(=O)[C@H](O)c1cc(-c2ccc(cc2)S(C)(=O)=O)n(c1C)-c1ccccc1 |r|
Show InChI InChI=1S/C22H23NO5S/c1-4-28-22(25)21(24)19-14-20(16-10-12-18(13-11-16)29(3,26)27)23(15(19)2)17-8-6-5-7-9-17/h5-14,21,24H,4H2,1-3H3/t21-/m1/s1
Reactome pathway
n/an/a>1.00E+5n/an/an/an/an/an/a
Università La Sapienza
Curated by ChEMBL
Assay Description
Inhibition of COX1 in arachidonic acid-stimulated mouse J774 cells assessed as inhibition of PGE2 production after 15 mins by radioimmunoassay
Bioorg Med Chem 16: 8072-81 (2008)
Article DOI: 10.1016/j.bmc.2008.07.058
BindingDB Entry DOI: 10.7270/Q24J0DZW