BDBM50253673 CHEMBL4063842
SMILES: Cc1n[nH]cc1-c1cc2nc(C)[nH]c(=O)c2s1
InChI Key: InChIKey=RUUJYTNSADMBID-UHFFFAOYSA-N
Data: 3 IC50
Activity Spreadsheet -- Enzyme Inhibition Constant Data from BindingDB
Found 3 hits for monomerid = 50253673
Trg + Lig
Ki
nM
ΔG°
kcal/mole
IC50
nM
Kd
nM
EC50/IC50
nM
koff
s-1
kon
M-1s-1
pHTemp
°C
Rho-associated protein kinase 1
(Homo sapiens (Human))
BDBM50253673
(CHEMBL4063842)
Show SMILES Cc1n[nH]cc1-c1cc2nc(C)[nH]c(=O)c2s1
Show InChI InChI=1S/C11H10N4OS/c1-5-7(4-12-15-5)9-3-8-10(17-9)11(16)14-6(2)13-8/h3-4H,1-2H3,(H,12,15)(H,13,14,16)
NCI pathway
Reactome pathway
n/an/a 1.50E+3n/an/an/an/an/an/a
Takeda Pharmaceutical Company, Ltd.
Curated by ChEMBL
Assay Description
Inhibition of recombinant human N-terminal GST-tagged ROCK1 catalytic domain (1 to 477 residues) expressed in baculovirus expression system using Bio...
Bioorg Med Chem 25: 3658-3670 (2017)
Article DOI: 10.1016/j.bmc.2017.04.044
BindingDB Entry DOI: 10.7270/Q26H4KTZ
CDC7 and DBF4
(Homo sapiens (Human))
BDBM50253673
(CHEMBL4063842)
Show SMILES Cc1n[nH]cc1-c1cc2nc(C)[nH]c(=O)c2s1
Show InChI InChI=1S/C11H10N4OS/c1-5-7(4-12-15-5)9-3-8-10(17-9)11(16)14-6(2)13-8/h3-4H,1-2H3,(H,12,15)(H,13,14,16)
n/an/a 75n/an/an/an/an/an/a
Takeda Pharmaceutical Company, Ltd.
Curated by ChEMBL
Assay Description
Inhibition of recombinant human full length Cdc7 (1 to 574 residues)/human N-terminal GST-tagged ASK (1 to 674 residues) expressed in baculovirus exp...
Bioorg Med Chem 25: 3658-3670 (2017)
Article DOI: 10.1016/j.bmc.2017.04.044
BindingDB Entry DOI: 10.7270/Q26H4KTZ
CDK2/CycE
(Homo sapiens (Human))
BDBM50253673
(CHEMBL4063842)
Show SMILES Cc1n[nH]cc1-c1cc2nc(C)[nH]c(=O)c2s1
Show InChI InChI=1S/C11H10N4OS/c1-5-7(4-12-15-5)9-3-8-10(17-9)11(16)14-6(2)13-8/h3-4H,1-2H3,(H,12,15)(H,13,14,16)
n/an/a 990n/an/an/an/an/an/a
Takeda Pharmaceutical Company, Ltd.
Curated by ChEMBL
Assay Description
Inhibition of full length human CDC2 (1 to 298 residues)/human N-terminal GST-tagged CyclinE1 (1 to 410 residues) expressed in baculovirus expression...
Bioorg Med Chem 25: 3658-3670 (2017)
Article DOI: 10.1016/j.bmc.2017.04.044
BindingDB Entry DOI: 10.7270/Q26H4KTZ