BDBM50253705 CHEMBL461216::N-(Azepan-1-yl)-5-(5-bromothiophen-2-yl)-1-(2,4-dichlorophenyl)-4-methyl-1H-pyrazole-3-carboxamide
SMILES: Cc1c(nn(c1-c1ccc(Br)s1)-c1ccc(Cl)cc1Cl)C(=O)NN1CCCCCC1
InChI Key: InChIKey=XKHUPGMHSOHXQD-UHFFFAOYSA-N
Data: 2 IC50  1 EC50
Activity Spreadsheet -- Enzyme Inhibition Constant Data from BindingDB
Found 3 hits for monomerid = 50253705
Trg + Lig
Ki
nM
ΔG°
kcal/mole
IC50
nM
Kd
nM
EC50/IC50
nM
koff
s-1
kon
M-1s-1
pHTemp
°C
Cannabinoid receptor 1
(Homo sapiens (Human))
BDBM50253705
(CHEMBL461216 | N-(Azepan-1-yl)-5-(5-bromothiophen-...)
Show SMILES Cc1c(nn(c1-c1ccc(Br)s1)-c1ccc(Cl)cc1Cl)C(=O)NN1CCCCCC1
Show InChI InChI=1S/C21H21BrCl2N4OS/c1-13-19(21(29)26-27-10-4-2-3-5-11-27)25-28(16-7-6-14(23)12-15(16)24)20(13)17-8-9-18(22)30-17/h6-9,12H,2-5,10-11H2,1H3,(H,26,29)
NCI pathway
Reactome pathway
n/an/a 40.7n/an/an/an/an/an/a
National Health Research Institutes
Curated by ChEMBL
Assay Description
Displacement of [3H]CP55940 from human CB1 receptor expressed in HEK293 cells
J Med Chem 51: 5397-412 (2008)
Article DOI: 10.1021/jm800066v
BindingDB Entry DOI: 10.7270/Q24M94BM
Cannabinoid receptor 1
(Homo sapiens (Human))
BDBM50253705
(CHEMBL461216 | N-(Azepan-1-yl)-5-(5-bromothiophen-...)
Show SMILES Cc1c(nn(c1-c1ccc(Br)s1)-c1ccc(Cl)cc1Cl)C(=O)NN1CCCCCC1
Show InChI InChI=1S/C21H21BrCl2N4OS/c1-13-19(21(29)26-27-10-4-2-3-5-11-27)25-28(16-7-6-14(23)12-15(16)24)20(13)17-8-9-18(22)30-17/h6-9,12H,2-5,10-11H2,1H3,(H,26,29)
NCI pathway
Reactome pathway
n/an/an/an/a 64.9n/an/an/an/a
National Health Research Institutes
Curated by ChEMBL
Assay Description
Antagonist activity at human CB1 receptor expressed in HEK293 cells assessed as inhibition of Eu-GTP binding
J Med Chem 51: 5397-412 (2008)
Article DOI: 10.1021/jm800066v
BindingDB Entry DOI: 10.7270/Q24M94BM
Cannabinoid receptor 2
(Homo sapiens (Human))
BDBM50253705
(CHEMBL461216 | N-(Azepan-1-yl)-5-(5-bromothiophen-...)
Show SMILES Cc1c(nn(c1-c1ccc(Br)s1)-c1ccc(Cl)cc1Cl)C(=O)NN1CCCCCC1
Show InChI InChI=1S/C21H21BrCl2N4OS/c1-13-19(21(29)26-27-10-4-2-3-5-11-27)25-28(16-7-6-14(23)12-15(16)24)20(13)17-8-9-18(22)30-17/h6-9,12H,2-5,10-11H2,1H3,(H,26,29)
Reactome pathway
n/an/a 705n/an/an/an/an/an/a
National Health Research Institutes
Curated by ChEMBL
Assay Description
Displacement of [3H]CP55940 from human CB2 receptor expressed in HEK293 cells
J Med Chem 51: 5397-412 (2008)
Article DOI: 10.1021/jm800066v
BindingDB Entry DOI: 10.7270/Q24M94BM