BDBM50253861 (+)-3-(4-Chlorophenyl)-N'-[(4-cyanophenyl)sulfonyl]-4-phenyl-4,5-dihydro-1H-pyrazole-1-carboxamidine::CHEMBL461855
SMILES: Clc1ccc(cc1)C1=NN(C[C@H]1c1ccccc1)C(=N)NS(=O)(=O)c1ccc(cc1)C#N
InChI Key: InChIKey=OQIBXTHHXDTIBJ-NRFANRHFSA-N
Data: 2 KI  2 IC50
Activity Spreadsheet -- Enzyme Inhibition Constant Data from BindingDB
Found 4 hits for monomerid = 50253861
Trg + Lig
Ki
nM
ΔG°
kcal/mole
IC50
nM
Kd
nM
EC50/IC50
nM
koff
s-1
kon
M-1s-1
pHTemp
°C
Cannabinoid receptor 1
(Homo sapiens (Human))
BDBM50253861
((+)-3-(4-Chlorophenyl)-N'-[(4-cyanophenyl)sulfonyl...)
Show SMILES Clc1ccc(cc1)C1=NN(C[C@H]1c1ccccc1)C(=N)NS(=O)(=O)c1ccc(cc1)C#N |r,t:8|
Show InChI InChI=1S/C23H18ClN5O2S/c24-19-10-8-18(9-11-19)22-21(17-4-2-1-3-5-17)15-29(27-22)23(26)28-32(30,31)20-12-6-16(14-25)7-13-20/h1-13,21H,15H2,(H2,26,28)/t21-/m0/s1
NCI pathway
Reactome pathway
16.9n/an/an/an/an/an/an/an/a
National Institute of Mental Health
Curated by ChEMBL
Assay Description
Binding affinity to human CB1 receptor by [35S]GTPgammaS binding assay
J Med Chem 51: 5608-16 (2008)
Article DOI: 10.1021/jm800329z
BindingDB Entry DOI: 10.7270/Q2GT5N00
Cannabinoid receptor 2
(Homo sapiens (Human))
BDBM50253861
((+)-3-(4-Chlorophenyl)-N'-[(4-cyanophenyl)sulfonyl...)
Show SMILES Clc1ccc(cc1)C1=NN(C[C@H]1c1ccccc1)C(=N)NS(=O)(=O)c1ccc(cc1)C#N |r,t:8|
Show InChI InChI=1S/C23H18ClN5O2S/c24-19-10-8-18(9-11-19)22-21(17-4-2-1-3-5-17)15-29(27-22)23(26)28-32(30,31)20-12-6-16(14-25)7-13-20/h1-13,21H,15H2,(H2,26,28)/t21-/m0/s1
Reactome pathway
>5.00E+3n/an/an/an/an/an/an/an/a
National Institute of Mental Health
Curated by ChEMBL
Assay Description
Binding affinity to human CB2 receptor by [35S]GTPgammaS binding assay
J Med Chem 51: 5608-16 (2008)
Article DOI: 10.1021/jm800329z
BindingDB Entry DOI: 10.7270/Q2GT5N00
Cannabinoid receptor 2
(Homo sapiens (Human))
BDBM50253861
((+)-3-(4-Chlorophenyl)-N'-[(4-cyanophenyl)sulfonyl...)
Show SMILES Clc1ccc(cc1)C1=NN(C[C@H]1c1ccccc1)C(=N)NS(=O)(=O)c1ccc(cc1)C#N |r,t:8|
Show InChI InChI=1S/C23H18ClN5O2S/c24-19-10-8-18(9-11-19)22-21(17-4-2-1-3-5-17)15-29(27-22)23(26)28-32(30,31)20-12-6-16(14-25)7-13-20/h1-13,21H,15H2,(H2,26,28)/t21-/m0/s1
Reactome pathway
n/an/a>3.30E+4n/an/an/an/an/an/a
National Institute of Mental Health
Curated by ChEMBL
Assay Description
Binding affinity to human CB2 receptor by [35S]GTPgammaS binding assay
J Med Chem 51: 5608-16 (2008)
Article DOI: 10.1021/jm800329z
BindingDB Entry DOI: 10.7270/Q2GT5N00
Cannabinoid receptor 1
(Homo sapiens (Human))
BDBM50253861
((+)-3-(4-Chlorophenyl)-N'-[(4-cyanophenyl)sulfonyl...)
Show SMILES Clc1ccc(cc1)C1=NN(C[C@H]1c1ccccc1)C(=N)NS(=O)(=O)c1ccc(cc1)C#N |r,t:8|
Show InChI InChI=1S/C23H18ClN5O2S/c24-19-10-8-18(9-11-19)22-21(17-4-2-1-3-5-17)15-29(27-22)23(26)28-32(30,31)20-12-6-16(14-25)7-13-20/h1-13,21H,15H2,(H2,26,28)/t21-/m0/s1
NCI pathway
Reactome pathway
n/an/a 100n/an/an/an/an/an/a
National Institute of Mental Health
Curated by ChEMBL
Assay Description
Binding affinity to human CB1 receptor by [35S]GTPgammaS binding assay
J Med Chem 51: 5608-16 (2008)
Article DOI: 10.1021/jm800329z
BindingDB Entry DOI: 10.7270/Q2GT5N00