BDBM50254050 (R)-3-(1H-indol-4-yl)-N-methyl-3-(thiophen-2-yl)propan-1-amine hydrochloride::CHEMBL511690
SMILES: CNCC[C@@H](c1cccs1)c1cccc2[nH]ccc12
InChI Key: InChIKey=YQKYZMKIRHBJGF-CQSZACIVSA-N
Data: 2 KI  1 IC50
Activity Spreadsheet -- Enzyme Inhibition Constant Data from BindingDB
Found 3 hits for monomerid = 50254050
Trg + Lig
Ki
nM
ΔG°
kcal/mole
IC50
nM
Kd
nM
EC50/IC50
nM
koff
s-1
kon
M-1s-1
pHTemp
°C
Transporter
(Rattus norvegicus (rat))
BDBM50254050
((R)-3-(1H-indol-4-yl)-N-methyl-3-(thiophen-2-yl)pr...)
Show SMILES CNCC[C@@H](c1cccs1)c1cccc2[nH]ccc12 |r|
Show InChI InChI=1S/C16H18N2S/c1-17-9-7-14(16-6-3-11-19-16)12-4-2-5-15-13(12)8-10-18-15/h2-6,8,10-11,14,17-18H,7,9H2,1H3/t14-/m1/s1
Reactome pathway
102n/an/an/an/an/an/an/an/a
The State University of New York
Curated by ChEMBL
Assay Description
Displacement of [3H]nisoxetine from Sprague-dawley rat NET by liquid scintillation spectrophotometry
Bioorg Med Chem Lett 19: 58-61 (2008)
Article DOI: 10.1016/j.bmcl.2008.11.022
BindingDB Entry DOI: 10.7270/Q2N58N95
Sodium-dependent serotonin transporter
(Rattus norvegicus (rat))
BDBM50254050
((R)-3-(1H-indol-4-yl)-N-methyl-3-(thiophen-2-yl)pr...)
Show SMILES CNCC[C@@H](c1cccs1)c1cccc2[nH]ccc12 |r|
Show InChI InChI=1S/C16H18N2S/c1-17-9-7-14(16-6-3-11-19-16)12-4-2-5-15-13(12)8-10-18-15/h2-6,8,10-11,14,17-18H,7,9H2,1H3/t14-/m1/s1
166n/an/an/an/an/an/an/an/a
The State University of New York
Curated by ChEMBL
Assay Description
Displacement of [3H]citalopram from SERT in Sprague-dawley rat frontal cortex by liquid scintillation spectrophotometry
Bioorg Med Chem Lett 19: 58-61 (2008)
Article DOI: 10.1016/j.bmcl.2008.11.022
BindingDB Entry DOI: 10.7270/Q2N58N95
Sodium-dependent dopamine transporter
(Rattus norvegicus (rat))
BDBM50254050
((R)-3-(1H-indol-4-yl)-N-methyl-3-(thiophen-2-yl)pr...)
Show SMILES CNCC[C@@H](c1cccs1)c1cccc2[nH]ccc12 |r|
Show InChI InChI=1S/C16H18N2S/c1-17-9-7-14(16-6-3-11-19-16)12-4-2-5-15-13(12)8-10-18-15/h2-6,8,10-11,14,17-18H,7,9H2,1H3/t14-/m1/s1
Reactome pathway
n/an/a 572n/an/an/an/an/an/a
The State University of New York
Curated by ChEMBL
Assay Description
Displacement of [125I]RTI55 from DAT in Sprague-dawley rat striatum by liquid scintillation spectrophotometry
Bioorg Med Chem Lett 19: 58-61 (2008)
Article DOI: 10.1016/j.bmcl.2008.11.022
BindingDB Entry DOI: 10.7270/Q2N58N95