null
SMILES: CC(C)Nc1nc(Nc2ccc(cc2)C(F)(F)F)c2nc(Nc3c(Cl)cccc3Cl)sc2n1
InChI Key: InChIKey=FFBBIJYCAUUUNB-UHFFFAOYSA-N
Activity Spreadsheet -- Enzyme Inhibition Constant Data from BindingDB
Found 2 hits for monomerid = 50254054
Trg + Lig
Ki
nM
ΔG°
kcal/mole
IC50
nM
Kd
nM
EC50/IC50
nM
koff
s-1
kon
M-1s-1
pHTemp
°C
Transient receptor potential cation channel subfamily V member 1
(Rattus norvegicus (rat))
BDBM50254054
(CHEMBL462276 | N2-(2,6-dichlorophenyl)-N5-isopropy...)
Show SMILES CC(C)Nc1nc(Nc2ccc(cc2)C(F)(F)F)c2nc(Nc3c(Cl)cccc3Cl)sc2n1
Show InChI InChI=1S/C21H17Cl2F3N6S/c1-10(2)27-19-31-17(28-12-8-6-11(7-9-12)21(24,25)26)16-18(32-19)33-20(30-16)29-15-13(22)4-3-5-14(15)23/h3-10H,1-2H3,(H,29,30)(H2,27,28,31,32)
Reactome pathway
n/an/a 9n/an/an/an/an/an/a
Johnson & Johnson Pharmaceutical Research and Development LLC
Curated by ChEMBL
Assay Description
Antagonist activity at rat TRPV1 expressed in HEK293 cells assessed as inhibition of capsaicin-induced calcium flux
Bioorg Med Chem Lett 19: 40-6 (2008)
Article DOI: 10.1016/j.bmcl.2008.11.024
BindingDB Entry DOI: 10.7270/Q28052G3
Transient receptor potential cation channel subfamily V member 1
(Homo sapiens (Human))
BDBM50254054
(CHEMBL462276 | N2-(2,6-dichlorophenyl)-N5-isopropy...)
Show SMILES CC(C)Nc1nc(Nc2ccc(cc2)C(F)(F)F)c2nc(Nc3c(Cl)cccc3Cl)sc2n1
Show InChI InChI=1S/C21H17Cl2F3N6S/c1-10(2)27-19-31-17(28-12-8-6-11(7-9-12)21(24,25)26)16-18(32-19)33-20(30-16)29-15-13(22)4-3-5-14(15)23/h3-10H,1-2H3,(H,29,30)(H2,27,28,31,32)
Reactome pathway
n/an/a 13n/an/an/an/an/an/a
Johnson & Johnson Pharmaceutical Research and Development LLC
Curated by ChEMBL
Assay Description
Antagonist activity at human TRPV1 expressed in HEK293 cells assessed as inhibition of capsaicin-induced calcium flux
Bioorg Med Chem Lett 19: 40-6 (2008)
Article DOI: 10.1016/j.bmcl.2008.11.024
BindingDB Entry DOI: 10.7270/Q28052G3