BDBM50254107 CHEMBL4105659
SMILES: CC[C@H](C)[C@H](NC(=O)[C@H](CCCNC(N)=N)NC(=O)[C@H](CC(O)=O)NC(=O)[C@@H](NC(=O)[C@H](CCCNC(N)=N)NC(=O)CNC(=O)CNC(=O)[C@H](CC1CCCCC1)NC(=O)[C@H](C)N)[C@@H](C)CC)C(=O)NCC(N)=O
InChI Key: InChIKey=OZUJXEXKIYCYOP-QPZZXYADSA-N
Data: 2 IC50
Activity Spreadsheet -- Enzyme Inhibition Constant Data from BindingDB
Found 2 hits for monomerid = 50254107
Trg + Lig
Ki
nM
ΔG°
kcal/mole
IC50
nM
Kd
nM
EC50/IC50
nM
koff
s-1
kon
M-1s-1
pHTemp
°C
Atrial natriuretic peptide receptor 3
(Homo sapiens (Human))
BDBM50254107
(CHEMBL4105659)
Show SMILES CC[C@H](C)[C@H](NC(=O)[C@H](CCCNC(N)=N)NC(=O)[C@H](CC(O)=O)NC(=O)[C@@H](NC(=O)[C@H](CCCNC(N)=N)NC(=O)CNC(=O)CNC(=O)[C@H](CC1CCCCC1)NC(=O)[C@H](C)N)[C@@H](C)CC)C(=O)NCC(N)=O |r|
Show InChI InChI=1S/C46H83N17O12/c1-6-24(3)36(43(74)56-21-32(48)64)62-41(72)29(16-12-18-54-46(51)52)59-42(73)31(20-35(67)68)61-44(75)37(25(4)7-2)63-40(71)28(15-11-17-53-45(49)50)58-34(66)23-55-33(65)22-57-39(70)30(60-38(69)26(5)47)19-27-13-9-8-10-14-27/h24-31,36-37H,6-23,47H2,1-5H3,(H2,48,64)(H,55,65)(H,56,74)(H,57,70)(H,58,66)(H,59,73)(H,60,69)(H,61,75)(H,62,72)(H,63,71)(H,67,68)(H4,49,50,53)(H4,51,52,54)/t24-,25-,26-,28-,29-,30-,31-,36-,37-/m0/s1
n/an/a 13n/an/an/an/an/an/a
Takeda Pharmaceutical Company Ltd
Curated by ChEMBL
Assay Description
Displacement of [125I]-human ANP from His-tagged and Fc fragment containing human NPR-3 extracellular domain expressed in FreeStyle 293 cells incubat...
Bioorg Med Chem Lett 27: 3542-3545 (2017)
Article DOI: 10.1016/j.bmcl.2017.05.061
BindingDB Entry DOI: 10.7270/Q2F19241
Atrial natriuretic peptide receptor
(Homo sapiens (Human))
BDBM50254107
(CHEMBL4105659)
Show SMILES CC[C@H](C)[C@H](NC(=O)[C@H](CCCNC(N)=N)NC(=O)[C@H](CC(O)=O)NC(=O)[C@@H](NC(=O)[C@H](CCCNC(N)=N)NC(=O)CNC(=O)CNC(=O)[C@H](CC1CCCCC1)NC(=O)[C@H](C)N)[C@@H](C)CC)C(=O)NCC(N)=O |r|
Show InChI InChI=1S/C46H83N17O12/c1-6-24(3)36(43(74)56-21-32(48)64)62-41(72)29(16-12-18-54-46(51)52)59-42(73)31(20-35(67)68)61-44(75)37(25(4)7-2)63-40(71)28(15-11-17-53-45(49)50)58-34(66)23-55-33(65)22-57-39(70)30(60-38(69)26(5)47)19-27-13-9-8-10-14-27/h24-31,36-37H,6-23,47H2,1-5H3,(H2,48,64)(H,55,65)(H,56,74)(H,57,70)(H,58,66)(H,59,73)(H,60,69)(H,61,75)(H,62,72)(H,63,71)(H,67,68)(H4,49,50,53)(H4,51,52,54)/t24-,25-,26-,28-,29-,30-,31-,36-,37-/m0/s1
n/an/a>1.00E+3n/an/an/an/an/an/a
Takeda Pharmaceutical Company Ltd
Curated by ChEMBL
Assay Description
Displacement of [125I]-human ANP from human NPR-1 incubated for 2 hrs by top count method
Bioorg Med Chem Lett 27: 3542-3545 (2017)
Article DOI: 10.1016/j.bmcl.2017.05.061
BindingDB Entry DOI: 10.7270/Q2F19241