BDBM50254288 CHEMBL4074057
SMILES: Cl.COc1cc(CN2CCCCC2)ccc1O
InChI Key: InChIKey=BKZDFGOUPCCFCI-UHFFFAOYSA-N
Data: 1 KI  1 IC50
Activity Spreadsheet -- Enzyme Inhibition Constant Data from BindingDB
Found 2 hits for monomerid = 50254288
Trg + Lig
Ki
nM
ΔG°
kcal/mole
IC50
nM
Kd
nM
EC50/IC50
nM
koff
s-1
kon
M-1s-1
pHTemp
°C
Acetylcholinesterase
(Electrophorus electricus (Electric eel))
BDBM50254288
(CHEMBL4074057)
Show SMILES Cl.COc1cc(CN2CCCCC2)ccc1O
Show InChI InChI=1S/C13H19NO2/c1-16-13-9-11(5-6-12(13)15)10-14-7-3-2-4-8-14/h5-6,9,15H,2-4,7-8,10H2,1H3
1.06E+5n/an/an/an/an/an/an/an/a
Department of Chemistry and Biochemistry, The Ohio State University, Marion Campus, 1465 Mt. Vernon Avenue, Marion, Ohio 43302, United States.
Curated by ChEMBL
Assay Description
Mixed type inhibition of Electric eel AChE assessed as inhibition constant using acetylthiocholine as substrate after 7 min by Ellman's method
ACS Med Chem Lett 8: 622-627 (2017)
Article DOI: 10.1021/acsmedchemlett.7b00037
BindingDB Entry DOI: 10.7270/Q20V8G76
Acetylcholinesterase
(Electrophorus electricus (Electric eel))
BDBM50254288
(CHEMBL4074057)
Show SMILES Cl.COc1cc(CN2CCCCC2)ccc1O
Show InChI InChI=1S/C13H19NO2/c1-16-13-9-11(5-6-12(13)15)10-14-7-3-2-4-8-14/h5-6,9,15H,2-4,7-8,10H2,1H3
n/an/a 2.27E+5n/an/an/an/an/an/a
Department of Chemistry and Biochemistry, The Ohio State University, Marion Campus, 1465 Mt. Vernon Avenue, Marion, Ohio 43302, United States.
Curated by ChEMBL
Assay Description
Inhibition of Electric eel AChE using acetylthiocholine as substrate after 7 min by Ellman's method
ACS Med Chem Lett 8: 622-627 (2017)
Article DOI: 10.1021/acsmedchemlett.7b00037
BindingDB Entry DOI: 10.7270/Q20V8G76