BDBM50254393 1-benzhydryl-3-(2-methyl-5-(piperidin-1-ylsulfonyl)furan-3-yl)urea::CHEMBL466198
SMILES: Cc1oc(cc1NC(=O)NC(c1ccccc1)c1ccccc1)S(=O)(=O)N1CCCCC1
InChI Key: InChIKey=KLEAMVCCOPHYFK-UHFFFAOYSA-N
Data: 2 IC50
Activity Spreadsheet -- Enzyme Inhibition Constant Data from BindingDB
Found 2 hits for monomerid = 50254393
Trg + Lig
Ki
nM
ΔG°
kcal/mole
IC50
nM
Kd
nM
EC50/IC50
nM
koff
s-1
kon
M-1s-1
pHTemp
°C
Lipoprotein lipase
(Rattus norvegicus)
BDBM50254393
(1-benzhydryl-3-(2-methyl-5-(piperidin-1-ylsulfonyl...)
Show SMILES Cc1oc(cc1NC(=O)NC(c1ccccc1)c1ccccc1)S(=O)(=O)N1CCCCC1
Show InChI InChI=1S/C24H27N3O4S/c1-18-21(17-22(31-18)32(29,30)27-15-9-4-10-16-27)25-24(28)26-23(19-11-5-2-6-12-19)20-13-7-3-8-14-20/h2-3,5-8,11-14,17,23H,4,9-10,15-16H2,1H3,(H2,25,26,28)
Reactome pathway
n/an/a 2.50E+3n/an/an/an/an/an/a
GlaxoSmithKline
Curated by ChEMBL
Assay Description
Inhibition of Lipoprotein lipase from adipose tissue of rat
Bioorg Med Chem Lett 19: 27-30 (2008)
Article DOI: 10.1016/j.bmcl.2008.11.033
BindingDB Entry DOI: 10.7270/Q2BP02NZ
Endothelial lipase
(Homo sapiens (Human))
BDBM50254393
(1-benzhydryl-3-(2-methyl-5-(piperidin-1-ylsulfonyl...)
Show SMILES Cc1oc(cc1NC(=O)NC(c1ccccc1)c1ccccc1)S(=O)(=O)N1CCCCC1
Show InChI InChI=1S/C24H27N3O4S/c1-18-21(17-22(31-18)32(29,30)27-15-9-4-10-16-27)25-24(28)26-23(19-11-5-2-6-12-19)20-13-7-3-8-14-20/h2-3,5-8,11-14,17,23H,4,9-10,15-16H2,1H3,(H2,25,26,28)
n/an/a 160n/an/an/an/an/an/a
GlaxoSmithKline
Curated by ChEMBL
Assay Description
Inhibition of endothelial lipase (unknown origin)
Bioorg Med Chem Lett 19: 27-30 (2008)
Article DOI: 10.1016/j.bmcl.2008.11.033
BindingDB Entry DOI: 10.7270/Q2BP02NZ