null
SMILES: Clc1cccc(Cl)c1Nc1nc2c(Nc3ccc(cc3)S(=O)(=O)N3CCCC3)ncnc2s1
InChI Key: InChIKey=WMGVRVGVSGARAS-UHFFFAOYSA-N
Activity Spreadsheet -- Enzyme Inhibition Constant Data from BindingDB
Found 2 hits for monomerid = 50254419
Trg + Lig
Ki
nM
ΔG°
kcal/mole
IC50
nM
Kd
nM
EC50/IC50
nM
koff
s-1
kon
M-1s-1
pHTemp
°C
Transient receptor potential cation channel subfamily V member 1
(Rattus norvegicus (rat))
BDBM50254419
(CHEMBL511391 | N2-(2,6-dichlorophenyl)-N7-(4-(pyrr...)
Show SMILES Clc1cccc(Cl)c1Nc1nc2c(Nc3ccc(cc3)S(=O)(=O)N3CCCC3)ncnc2s1
Show InChI InChI=1S/C21H18Cl2N6O2S2/c22-15-4-3-5-16(23)17(15)27-21-28-18-19(24-12-25-20(18)32-21)26-13-6-8-14(9-7-13)33(30,31)29-10-1-2-11-29/h3-9,12H,1-2,10-11H2,(H,27,28)(H,24,25,26)
Reactome pathway
n/an/a 0.5n/an/an/an/an/an/a
Johnson & Johnson Pharmaceutical Research and Development LLC
Curated by ChEMBL
Assay Description
Antagonist activity at rat TRPV1 expressed in HEK293 cells assessed as inhibition of capsaicin-induced calcium flux
Bioorg Med Chem Lett 19: 40-6 (2008)
Article DOI: 10.1016/j.bmcl.2008.11.024
BindingDB Entry DOI: 10.7270/Q28052G3
Transient receptor potential cation channel subfamily V member 1
(Homo sapiens (Human))
BDBM50254419
(CHEMBL511391 | N2-(2,6-dichlorophenyl)-N7-(4-(pyrr...)
Show SMILES Clc1cccc(Cl)c1Nc1nc2c(Nc3ccc(cc3)S(=O)(=O)N3CCCC3)ncnc2s1
Show InChI InChI=1S/C21H18Cl2N6O2S2/c22-15-4-3-5-16(23)17(15)27-21-28-18-19(24-12-25-20(18)32-21)26-13-6-8-14(9-7-13)33(30,31)29-10-1-2-11-29/h3-9,12H,1-2,10-11H2,(H,27,28)(H,24,25,26)
Reactome pathway
n/an/a 1n/an/an/an/an/an/a
Johnson & Johnson Pharmaceutical Research and Development LLC
Curated by ChEMBL
Assay Description
Antagonist activity at human TRPV1 expressed in HEK293 cells assessed as inhibition of capsaicin-induced calcium flux
Bioorg Med Chem Lett 19: 40-6 (2008)
Article DOI: 10.1016/j.bmcl.2008.11.024
BindingDB Entry DOI: 10.7270/Q28052G3