null
SMILES: Clc1cc(sc1Cl)S(=O)(=O)NC(=O)COc1cccc2[nH]cc(c12)S(=O)(=O)c1nc2ccccc2s1
InChI Key: InChIKey=QZAYLNWWEKTAJU-UHFFFAOYSA-N
Activity Spreadsheet -- Enzyme Inhibition Constant Data from BindingDB
Found 2 hits for monomerid = 50254476
Trg + Lig
Ki
nM
ΔG°
kcal/mole
IC50
nM
Kd
nM
EC50/IC50
nM
koff
s-1
kon
M-1s-1
pHTemp
°C
Prostaglandin E2 receptor EP3 subtype
(Homo sapiens (Human))
BDBM50254476
(2-(3-(benzo[d]thiazol-2-ylsulfonyl)-1H-indol-4-ylo...)
Show SMILES Clc1cc(sc1Cl)S(=O)(=O)NC(=O)COc1cccc2[nH]cc(c12)S(=O)(=O)c1nc2ccccc2s1
Show InChI InChI=1S/C21H13Cl2N3O6S4/c22-11-8-18(34-20(11)23)36(30,31)26-17(27)10-32-14-6-3-5-13-19(14)16(9-24-13)35(28,29)21-25-12-4-1-2-7-15(12)33-21/h1-9,24H,10H2,(H,26,27)
n/an/a 44n/an/an/an/an/an/a
deCODE Chemistry, Inc
Curated by ChEMBL
Assay Description
Displacement of [3H]PGE2 from human EP3 receptor
Bioorg Med Chem Lett 19: 123-6 (2008)
Article DOI: 10.1016/j.bmcl.2008.11.007
BindingDB Entry DOI: 10.7270/Q2JH3M1S
Prostaglandin E2 receptor EP3 subtype
(Homo sapiens (Human))
BDBM50254476
(2-(3-(benzo[d]thiazol-2-ylsulfonyl)-1H-indol-4-ylo...)
Show SMILES Clc1cc(sc1Cl)S(=O)(=O)NC(=O)COc1cccc2[nH]cc(c12)S(=O)(=O)c1nc2ccccc2s1
Show InChI InChI=1S/C21H13Cl2N3O6S4/c22-11-8-18(34-20(11)23)36(30,31)26-17(27)10-32-14-6-3-5-13-19(14)16(9-24-13)35(28,29)21-25-12-4-1-2-7-15(12)33-21/h1-9,24H,10H2,(H,26,27)
n/an/a 7.60n/an/an/an/an/an/a
deCODE Chemistry, Inc
Curated by ChEMBL
Assay Description
Displacement of [3H]PGE2 from human EP3 receptor in presence of 10% human serum
Bioorg Med Chem Lett 19: 123-6 (2008)
Article DOI: 10.1016/j.bmcl.2008.11.007
BindingDB Entry DOI: 10.7270/Q2JH3M1S