BDBM50254485 3-(dimethylamino)butyl propylcarbamate::CHEMBL466399
SMILES: CCCNC(=O)OCCC(C)N(C)C
InChI Key: InChIKey=YOGAMLRQMJSVCJ-UHFFFAOYSA-N
Data: 4 KI  1 EC50
Activity Spreadsheet -- Enzyme Inhibition Constant Data from BindingDB
Found 5 hits for monomerid = 50254485
Trg + Lig
Ki
nM
ΔG°
kcal/mole
IC50
nM
Kd
nM
EC50/IC50
nM
koff
s-1
kon
M-1s-1
pHTemp
°C
Neuronal acetylcholine receptor subunit alpha-4
(Homo sapiens (Human))
BDBM50254485
(3-(dimethylamino)butyl propylcarbamate | CHEMBL466...)
Show SMILES CCCNC(=O)OCCC(C)N(C)C
Show InChI InChI=1S/C10H22N2O2/c1-5-7-11-10(13)14-8-6-9(2)12(3)4/h9H,5-8H2,1-4H3,(H,11,13)
50n/an/an/an/an/an/an/an/a
Copenhagen University
Curated by ChEMBL
Assay Description
Displacement of [3H]epibatidine from alpha4beta2 nAChR (unknown origin) expressed in HEK293 cells
Bioorg Med Chem Lett 19: 87-91 (2008)
Article DOI: 10.1016/j.bmcl.2008.11.011
BindingDB Entry DOI: 10.7270/Q2571BV9
Neuronal acetylcholine receptor subunit alpha-4
(Homo sapiens (Human))
BDBM50254485
(3-(dimethylamino)butyl propylcarbamate | CHEMBL466...)
Show SMILES CCCNC(=O)OCCC(C)N(C)C
Show InChI InChI=1S/C10H22N2O2/c1-5-7-11-10(13)14-8-6-9(2)12(3)4/h9H,5-8H2,1-4H3,(H,11,13)
1.60E+3n/an/an/an/an/an/an/an/a
Copenhagen University
Curated by ChEMBL
Assay Description
Displacement of [3H]epibatidine from alpha4beta4 nAChR (unknown origin) expressed in HEK293 cells
Bioorg Med Chem Lett 19: 87-91 (2008)
Article DOI: 10.1016/j.bmcl.2008.11.011
BindingDB Entry DOI: 10.7270/Q2571BV9
Cholinergic, Nicotinic Alpha3Beta2
(Homo sapiens (Human))
BDBM50254485
(3-(dimethylamino)butyl propylcarbamate | CHEMBL466...)
Show SMILES CCCNC(=O)OCCC(C)N(C)C
Show InChI InChI=1S/C10H22N2O2/c1-5-7-11-10(13)14-8-6-9(2)12(3)4/h9H,5-8H2,1-4H3,(H,11,13)
5.01E+3n/an/an/an/an/an/an/an/a
Copenhagen University
Curated by ChEMBL
Assay Description
Displacement of [3H]epibatidine from alpha3beta4 nAChR (unknown origin) expressed in HEK293 cells
Bioorg Med Chem Lett 19: 87-91 (2008)
Article DOI: 10.1016/j.bmcl.2008.11.011
BindingDB Entry DOI: 10.7270/Q2571BV9
Neuronal acetylcholine receptor protein alpha-7 subunit
(Homo sapiens (Human))
BDBM50254485
(3-(dimethylamino)butyl propylcarbamate | CHEMBL466...)
Show SMILES CCCNC(=O)OCCC(C)N(C)C
Show InChI InChI=1S/C10H22N2O2/c1-5-7-11-10(13)14-8-6-9(2)12(3)4/h9H,5-8H2,1-4H3,(H,11,13)
>1.00E+6n/an/an/an/an/an/an/an/a
Copenhagen University
Curated by ChEMBL
Assay Description
Displacement of [3H]MLA from alpha7 nAChR/5HT3A receptor (unknown origin) expressed in HEK293 cells
Bioorg Med Chem Lett 19: 87-91 (2008)
Article DOI: 10.1016/j.bmcl.2008.11.011
BindingDB Entry DOI: 10.7270/Q2571BV9
Cholinergic, Nicotinic Alpha3Beta2
(Homo sapiens (Human))
BDBM50254485
(3-(dimethylamino)butyl propylcarbamate | CHEMBL466...)
Show SMILES CCCNC(=O)OCCC(C)N(C)C
Show InChI InChI=1S/C10H22N2O2/c1-5-7-11-10(13)14-8-6-9(2)12(3)4/h9H,5-8H2,1-4H3,(H,11,13)
n/an/an/an/a 9.50E+4n/an/an/an/a
Copenhagen University
Curated by ChEMBL
Assay Description
Agonist activity at alpha3beta4 nAChR (unknown origin) expressed in HEK293 cells by FLIPR membrane potential assay
Bioorg Med Chem Lett 19: 87-91 (2008)
Article DOI: 10.1016/j.bmcl.2008.11.011
BindingDB Entry DOI: 10.7270/Q2571BV9