null
SMILES: CC(C\C=C\C(=O)N(C)C)N(C)C
InChI Key: InChIKey=SZRDMKGSPWOQFL-SOFGYWHQSA-N
Activity Spreadsheet -- Enzyme Inhibition Constant Data from BindingDB
Found 5 hits for monomerid = 50254541
Trg + Lig
Ki
nM
ΔG°
kcal/mole
IC50
nM
Kd
nM
EC50/IC50
nM
koff
s-1
kon
M-1s-1
pHTemp
°C
Neuronal acetylcholine receptor subunit alpha-4
(Homo sapiens (Human))
BDBM50254541
(5-(dimethylamino)-N,N-dimethylhex-2-enamide | CHEM...)
Show SMILES CC(C\C=C\C(=O)N(C)C)N(C)C
Show InChI InChI=1S/C10H20N2O/c1-9(11(2)3)7-6-8-10(13)12(4)5/h6,8-9H,7H2,1-5H3/b8-6+
316n/an/an/an/an/an/an/an/a
Copenhagen University
Curated by ChEMBL
Assay Description
Displacement of [3H]epibatidine from alpha4beta2 nAChR (unknown origin) expressed in HEK293 cells
Bioorg Med Chem Lett 19: 87-91 (2008)
Article DOI: 10.1016/j.bmcl.2008.11.011
BindingDB Entry DOI: 10.7270/Q2571BV9
Neuronal acetylcholine receptor subunit alpha-4
(Homo sapiens (Human))
BDBM50254541
(5-(dimethylamino)-N,N-dimethylhex-2-enamide | CHEM...)
Show SMILES CC(C\C=C\C(=O)N(C)C)N(C)C
Show InChI InChI=1S/C10H20N2O/c1-9(11(2)3)7-6-8-10(13)12(4)5/h6,8-9H,7H2,1-5H3/b8-6+
2.50E+3n/an/an/an/an/an/an/an/a
Copenhagen University
Curated by ChEMBL
Assay Description
Displacement of [3H]epibatidine from alpha4beta4 nAChR (unknown origin) expressed in HEK293 cells
Bioorg Med Chem Lett 19: 87-91 (2008)
Article DOI: 10.1016/j.bmcl.2008.11.011
BindingDB Entry DOI: 10.7270/Q2571BV9
Neuronal acetylcholine receptor subunit alpha-3
(Homo sapiens (Human))
BDBM50254541
(5-(dimethylamino)-N,N-dimethylhex-2-enamide | CHEM...)
Show SMILES CC(C\C=C\C(=O)N(C)C)N(C)C
Show InChI InChI=1S/C10H20N2O/c1-9(11(2)3)7-6-8-10(13)12(4)5/h6,8-9H,7H2,1-5H3/b8-6+
6.30E+3n/an/an/an/an/an/an/an/a
Copenhagen University
Curated by ChEMBL
Assay Description
Displacement of [3H]epibatidine from alpha3beta4 nAChR (unknown origin) expressed in HEK293 cells
Bioorg Med Chem Lett 19: 87-91 (2008)
Article DOI: 10.1016/j.bmcl.2008.11.011
BindingDB Entry DOI: 10.7270/Q2571BV9
Neuronal acetylcholine receptor subunit alpha-7
(Homo sapiens (Human))
BDBM50254541
(5-(dimethylamino)-N,N-dimethylhex-2-enamide | CHEM...)
Show SMILES CC(C\C=C\C(=O)N(C)C)N(C)C
Show InChI InChI=1S/C10H20N2O/c1-9(11(2)3)7-6-8-10(13)12(4)5/h6,8-9H,7H2,1-5H3/b8-6+
>1.00E+6n/an/an/an/an/an/an/an/a
Copenhagen University
Curated by ChEMBL
Assay Description
Displacement of [3H]MLA from alpha7 nAChR/5HT3A receptor (unknown origin) expressed in HEK293 cells
Bioorg Med Chem Lett 19: 87-91 (2008)
Article DOI: 10.1016/j.bmcl.2008.11.011
BindingDB Entry DOI: 10.7270/Q2571BV9
Neuronal acetylcholine receptor subunit alpha-3
(Homo sapiens (Human))
BDBM50254541
(5-(dimethylamino)-N,N-dimethylhex-2-enamide | CHEM...)
Show SMILES CC(C\C=C\C(=O)N(C)C)N(C)C
Show InChI InChI=1S/C10H20N2O/c1-9(11(2)3)7-6-8-10(13)12(4)5/h6,8-9H,7H2,1-5H3/b8-6+
n/an/an/an/a 1.00E+5n/an/an/an/a
Copenhagen University
Curated by ChEMBL
Assay Description
Agonist activity at alpha3beta4 nAChR (unknown origin) expressed in HEK293 cells by FLIPR membrane potential assay
Bioorg Med Chem Lett 19: 87-91 (2008)
Article DOI: 10.1016/j.bmcl.2008.11.011
BindingDB Entry DOI: 10.7270/Q2571BV9