BDBM50254569 (2S,6S,11S)-6,11-Dimethyl-3-[(R)-1-(tetrahydro-furan-2-yl)methyl]-1,2,3,4,5,6-hexahydro-2,6-methano-benzo[d]azocin-8-ol::CHEMBL464071
SMILES: C[C@@H]1[C@@H]2Cc3ccc(O)cc3[C@@]1(C)CCN2C[C@H]1CCCO1
InChI Key: InChIKey=NLKLXMMOJZHSCB-OLQIXAPSSA-N
Data: 2 KI  1 EC50
Activity Spreadsheet -- Enzyme Inhibition Constant Data from BindingDB
Found 3 hits for monomerid = 50254569
Trg + Lig
Ki
nM
ΔG°
kcal/mole
IC50
nM
Kd
nM
EC50/IC50
nM
koff
s-1
kon
M-1s-1
pHTemp
°C
Kappa-type opioid receptor
(Cavia porcellus (domestic guinea pig))
BDBM50254569
((2S,6S,11S)-6,11-Dimethyl-3-[(R)-1-(tetrahydro-fur...)
Show SMILES C[C@@H]1[C@@H]2Cc3ccc(O)cc3[C@@]1(C)CCN2C[C@H]1CCCO1 |r,TLB:16:15:1:4.10.3|
Show InChI InChI=1S/C19H27NO2/c1-13-18-10-14-5-6-15(21)11-17(14)19(13,2)7-8-20(18)12-16-4-3-9-22-16/h5-6,11,13,16,18,21H,3-4,7-10,12H2,1-2H3/t13-,16-,18+,19+/m1/s1
1.5n/an/an/an/an/an/an/an/a
Rensselaer Polytechnic Institute
Curated by ChEMBL
Assay Description
Displacement of [3H]U69593 form kappa opioid receptor in guinea pig brain
Bioorg Med Chem Lett 19: 203-8 (2008)
Article DOI: 10.1016/j.bmcl.2008.10.134
BindingDB Entry DOI: 10.7270/Q2RX9D1K
Mu-type opioid receptor
(GUINEA PIG)
BDBM50254569
((2S,6S,11S)-6,11-Dimethyl-3-[(R)-1-(tetrahydro-fur...)
Show SMILES C[C@@H]1[C@@H]2Cc3ccc(O)cc3[C@@]1(C)CCN2C[C@H]1CCCO1 |r,TLB:16:15:1:4.10.3|
Show InChI InChI=1S/C19H27NO2/c1-13-18-10-14-5-6-15(21)11-17(14)19(13,2)7-8-20(18)12-16-4-3-9-22-16/h5-6,11,13,16,18,21H,3-4,7-10,12H2,1-2H3/t13-,16-,18+,19+/m1/s1
4n/an/an/an/an/an/an/an/a
Rensselaer Polytechnic Institute
Curated by ChEMBL
Assay Description
Displacement of [3H]DAMGO form mu opioid receptor in guinea pig brain
Bioorg Med Chem Lett 19: 203-8 (2008)
Article DOI: 10.1016/j.bmcl.2008.10.134
BindingDB Entry DOI: 10.7270/Q2RX9D1K
Kappa-type opioid receptor
(Homo sapiens (Human))
BDBM50254569
((2S,6S,11S)-6,11-Dimethyl-3-[(R)-1-(tetrahydro-fur...)
Show SMILES C[C@@H]1[C@@H]2Cc3ccc(O)cc3[C@@]1(C)CCN2C[C@H]1CCCO1 |r,TLB:16:15:1:4.10.3|
Show InChI InChI=1S/C19H27NO2/c1-13-18-10-14-5-6-15(21)11-17(14)19(13,2)7-8-20(18)12-16-4-3-9-22-16/h5-6,11,13,16,18,21H,3-4,7-10,12H2,1-2H3/t13-,16-,18+,19+/m1/s1
Reactome pathway
n/an/an/an/a 41n/an/an/an/a
Rensselaer Polytechnic Institute
Curated by ChEMBL
Assay Description
Activity at human cloned kappa opioid receptor expressed in CHO cells by [35S]GTPgammaS binding assay
Bioorg Med Chem Lett 19: 203-8 (2008)
Article DOI: 10.1016/j.bmcl.2008.10.134
BindingDB Entry DOI: 10.7270/Q2RX9D1K