BDBM50254689 2-(3-(4-(2-amino-2-oxoethyl)phenylsulfonyl)-1H-indol-4-yloxy)-N-(4,5-dichlorothiophen-2-ylsulfonyl)acetamide::CHEMBL464042
SMILES: NC(=O)Cc1ccc(cc1)S(=O)(=O)c1c[nH]c2cccc(OCC(=O)NS(=O)(=O)c3cc(Cl)c(Cl)s3)c12
InChI Key: InChIKey=BHXXLIORSYABJI-UHFFFAOYSA-N
Data: 2 IC50
Activity Spreadsheet -- Enzyme Inhibition Constant Data from BindingDB
Found 2 hits for monomerid = 50254689
Trg + Lig
Ki
nM
ΔG°
kcal/mole
IC50
nM
Kd
nM
EC50/IC50
nM
koff
s-1
kon
M-1s-1
pHTemp
°C
Prostaglandin E2 receptor
(Homo sapiens (Human))
BDBM50254689
(2-(3-(4-(2-amino-2-oxoethyl)phenylsulfonyl)-1H-ind...)
Show SMILES NC(=O)Cc1ccc(cc1)S(=O)(=O)c1c[nH]c2cccc(OCC(=O)NS(=O)(=O)c3cc(Cl)c(Cl)s3)c12
Show InChI InChI=1S/C22H17Cl2N3O7S3/c23-14-9-20(35-22(14)24)37(32,33)27-19(29)11-34-16-3-1-2-15-21(16)17(10-26-15)36(30,31)13-6-4-12(5-7-13)8-18(25)28/h1-7,9-10,26H,8,11H2,(H2,25,28)(H,27,29)
n/an/a 5n/an/an/an/an/an/a
deCODE Chemistry, Inc
Curated by ChEMBL
Assay Description
Displacement of [3H]PGE2 from human EP3 receptor in presence of 10% human serum
Bioorg Med Chem Lett 19: 123-6 (2008)
Article DOI: 10.1016/j.bmcl.2008.11.007
BindingDB Entry DOI: 10.7270/Q2JH3M1S
Prostaglandin E2 receptor
(Homo sapiens (Human))
BDBM50254689
(2-(3-(4-(2-amino-2-oxoethyl)phenylsulfonyl)-1H-ind...)
Show SMILES NC(=O)Cc1ccc(cc1)S(=O)(=O)c1c[nH]c2cccc(OCC(=O)NS(=O)(=O)c3cc(Cl)c(Cl)s3)c12
Show InChI InChI=1S/C22H17Cl2N3O7S3/c23-14-9-20(35-22(14)24)37(32,33)27-19(29)11-34-16-3-1-2-15-21(16)17(10-26-15)36(30,31)13-6-4-12(5-7-13)8-18(25)28/h1-7,9-10,26H,8,11H2,(H2,25,28)(H,27,29)
n/an/a 27.8n/an/an/an/an/an/a
deCODE Chemistry, Inc
Curated by ChEMBL
Assay Description
Displacement of [3H]PGE2 from human EP3 receptor
Bioorg Med Chem Lett 19: 123-6 (2008)
Article DOI: 10.1016/j.bmcl.2008.11.007
BindingDB Entry DOI: 10.7270/Q2JH3M1S