BDBM50254704 CHEMBL4073100
SMILES: Cc1cc(CSc2nnc(-c3ccccn3)n2Cc2ccco2)ccc1C(F)(F)F
InChI Key: InChIKey=WRMNIROOWCNWJI-UHFFFAOYSA-N
Data: 1 KI  1 EC50
Activity Spreadsheet -- Enzyme Inhibition Constant Data from BindingDB
Found 2 hits for monomerid = 50254704
Trg + Lig
Ki
nM
ΔG°
kcal/mole
IC50
nM
Kd
nM
EC50/IC50
nM
koff
s-1
kon
M-1s-1
pHTemp
°C
Kappa-type opioid receptor
(Homo sapiens (Human))
BDBM50254704
(CHEMBL4073100)
Show SMILES Cc1cc(CSc2nnc(-c3ccccn3)n2Cc2ccco2)ccc1C(F)(F)F
Show InChI InChI=1S/C21H17F3N4OS/c1-14-11-15(7-8-17(14)21(22,23)24)13-30-20-27-26-19(18-6-2-3-9-25-18)28(20)12-16-5-4-10-29-16/h2-11H,12-13H2,1H3
Reactome pathway
31n/an/an/an/an/an/an/an/a
Departments of Molecular Medicine and Neuroscience, The Scripps Research Institute, Jupiter, Florida 33458, United States.
Curated by ChEMBL
Assay Description
Agonist activity at human kappa opioid receptor expressed in CHO cell membranes by [35S]GTPgammaS binding assay
ACS Med Chem Lett 8: 694-700 (2017)
Article DOI: 10.1021/acsmedchemlett.7b00224
BindingDB Entry DOI: 10.7270/Q23N25TP
Kappa-type opioid receptor
(Homo sapiens (Human))
BDBM50254704
(CHEMBL4073100)
Show SMILES Cc1cc(CSc2nnc(-c3ccccn3)n2Cc2ccco2)ccc1C(F)(F)F
Show InChI InChI=1S/C21H17F3N4OS/c1-14-11-15(7-8-17(14)21(22,23)24)13-30-20-27-26-19(18-6-2-3-9-25-18)28(20)12-16-5-4-10-29-16/h2-11H,12-13H2,1H3
Reactome pathway
n/an/an/an/a 4.13E+3n/an/an/an/a
Departments of Molecular Medicine and Neuroscience, The Scripps Research Institute, Jupiter, Florida 33458, United States.
Curated by ChEMBL
Assay Description
Agonist activity at human kappa opioid receptor expressed in CHO cells assessed as beta-arrestin2 recruitment by enzyme fragment complementation meth...
ACS Med Chem Lett 8: 694-700 (2017)
Article DOI: 10.1021/acsmedchemlett.7b00224
BindingDB Entry DOI: 10.7270/Q23N25TP