BDBM50254706 CHEMBL226997
SMILES: CN([C@H]1CC[C@]2(CCCO2)C[C@@H]1N1CCCC1)C(=O)Cc1ccccc1
InChI Key: InChIKey=PGZRDDYTKFZSFR-JAXLGGSGSA-N
Data: 1 KI  1 EC50
Activity Spreadsheet -- Enzyme Inhibition Constant Data from BindingDB
Found 2 hits for monomerid = 50254706
Trg + Lig
Ki
nM
ΔG°
kcal/mole
IC50
nM
Kd
nM
EC50/IC50
nM
koff
s-1
kon
M-1s-1
pHTemp
°C
Kappa-type opioid receptor
(Homo sapiens (Human))
BDBM50254706
(CHEMBL226997)
Show SMILES CN([C@H]1CC[C@]2(CCCO2)C[C@@H]1N1CCCC1)C(=O)Cc1ccccc1
Show InChI InChI=1S/C22H32N2O2/c1-23(21(25)16-18-8-3-2-4-9-18)19-10-12-22(11-7-15-26-22)17-20(19)24-13-5-6-14-24/h2-4,8-9,19-20H,5-7,10-17H2,1H3/t19-,20-,22+/m0/s1
Reactome pathway
61n/an/an/an/an/an/an/an/a
Departments of Molecular Medicine and Neuroscience, The Scripps Research Institute, Jupiter, Florida 33458, United States.
Curated by ChEMBL
Assay Description
Agonist activity at human kappa opioid receptor expressed in CHO cell membranes by [35S]GTPgammaS binding assay
ACS Med Chem Lett 8: 694-700 (2017)
Article DOI: 10.1021/acsmedchemlett.7b00224
BindingDB Entry DOI: 10.7270/Q23N25TP
Kappa-type opioid receptor
(Homo sapiens (Human))
BDBM50254706
(CHEMBL226997)
Show SMILES CN([C@H]1CC[C@]2(CCCO2)C[C@@H]1N1CCCC1)C(=O)Cc1ccccc1
Show InChI InChI=1S/C22H32N2O2/c1-23(21(25)16-18-8-3-2-4-9-18)19-10-12-22(11-7-15-26-22)17-20(19)24-13-5-6-14-24/h2-4,8-9,19-20H,5-7,10-17H2,1H3/t19-,20-,22+/m0/s1
Reactome pathway
n/an/an/an/a 63n/an/an/an/a
Departments of Molecular Medicine and Neuroscience, The Scripps Research Institute, Jupiter, Florida 33458, United States.
Curated by ChEMBL
Assay Description
Agonist activity at human kappa opioid receptor expressed in CHO cell membranes by [35S]GTPgammaS binding assay
ACS Med Chem Lett 8: 694-700 (2017)
Article DOI: 10.1021/acsmedchemlett.7b00224
BindingDB Entry DOI: 10.7270/Q23N25TP