BDBM50254752 1-butyl-9-(1-(4,6-dimethylpyrimidine-5-carbonyl)-4-methylpiperidin-4-yl)-3-(4-fluorobenzyl)-3,9-diazaspiro[5.5]undecan-2-one::CHEMBL451400
SMILES: CCCCC1C(=O)N(Cc2ccc(F)cc2)CCC11CCN(CC1)C1(C)CCN(CC1)C(=O)c1c(C)ncnc1C
InChI Key: InChIKey=FUVFXKANLIQTMS-UHFFFAOYSA-N
Data: 1 IC50
Activity Spreadsheet -- Enzyme Inhibition Constant Data from BindingDB
Found 1 hit for monomerid = 50254752
Trg + Lig
Ki
nM
ΔG°
kcal/mole
IC50
nM
Kd
nM
EC50/IC50
nM
koff
s-1
kon
M-1s-1
pHTemp
°C
C-C chemokine receptor type 5
(Homo sapiens (Human))
BDBM50254752
(1-butyl-9-(1-(4,6-dimethylpyrimidine-5-carbonyl)-4...)
Show SMILES CCCCC1C(=O)N(Cc2ccc(F)cc2)CCC11CCN(CC1)C1(C)CCN(CC1)C(=O)c1c(C)ncnc1C
Show InChI InChI=1S/C33H46FN5O2/c1-5-6-7-28-30(40)38(22-26-8-10-27(34)11-9-26)19-14-33(28)15-20-39(21-16-33)32(4)12-17-37(18-13-32)31(41)29-24(2)35-23-36-25(29)3/h8-11,23,28H,5-7,12-22H2,1-4H3
n/an/a 19n/an/an/an/an/an/a
Roche Palo Alto LLC
Curated by ChEMBL
Assay Description
Antagonist activity at CCR5 receptor (unknown origin) by radiolabelled RANTES binding assay
Bioorg Med Chem Lett 19: 209-13 (2008)
Article DOI: 10.1016/j.bmcl.2008.10.115
BindingDB Entry DOI: 10.7270/Q2FQ9WGB