null
SMILES: COc1ccc(Sc2c[nH]c3cccc(OCC(=O)NS(=O)(=O)c4cc(Cl)c(Cl)s4)c23)cc1OC
InChI Key: InChIKey=DUUFBBCUYUGAGL-UHFFFAOYSA-N
Activity Spreadsheet -- Enzyme Inhibition Constant Data from BindingDB
Found 2 hits for monomerid = 50254880
Trg + Lig
Ki
nM
ΔG°
kcal/mole
IC50
nM
Kd
nM
EC50/IC50
nM
koff
s-1
kon
M-1s-1
pHTemp
°C
Prostaglandin E2 receptor EP3 subtype
(Homo sapiens (Human))
BDBM50254880
(CHEMBL520741 | N-(4,5-dichlorothiophen-2-ylsulfony...)
Show SMILES COc1ccc(Sc2c[nH]c3cccc(OCC(=O)NS(=O)(=O)c4cc(Cl)c(Cl)s4)c23)cc1OC
Show InChI InChI=1S/C22H18Cl2N2O6S3/c1-30-15-7-6-12(8-17(15)31-2)33-18-10-25-14-4-3-5-16(21(14)18)32-11-19(27)26-35(28,29)20-9-13(23)22(24)34-20/h3-10,25H,11H2,1-2H3,(H,26,27)
n/an/a 9.30n/an/an/an/an/an/a
deCODE Chemistry, Inc
Curated by ChEMBL
Assay Description
Displacement of [3H]PGE2 from human EP3 receptor
Bioorg Med Chem Lett 19: 123-6 (2008)
Article DOI: 10.1016/j.bmcl.2008.11.007
BindingDB Entry DOI: 10.7270/Q2JH3M1S
Prostaglandin E2 receptor EP3 subtype
(Homo sapiens (Human))
BDBM50254880
(CHEMBL520741 | N-(4,5-dichlorothiophen-2-ylsulfony...)
Show SMILES COc1ccc(Sc2c[nH]c3cccc(OCC(=O)NS(=O)(=O)c4cc(Cl)c(Cl)s4)c23)cc1OC
Show InChI InChI=1S/C22H18Cl2N2O6S3/c1-30-15-7-6-12(8-17(15)31-2)33-18-10-25-14-4-3-5-16(21(14)18)32-11-19(27)26-35(28,29)20-9-13(23)22(24)34-20/h3-10,25H,11H2,1-2H3,(H,26,27)
n/an/a 1.60n/an/an/an/an/an/a
deCODE Chemistry, Inc
Curated by ChEMBL
Assay Description
Displacement of [3H]PGE2 from human EP3 receptor in presence of 10% human serum
Bioorg Med Chem Lett 19: 123-6 (2008)
Article DOI: 10.1016/j.bmcl.2008.11.007
BindingDB Entry DOI: 10.7270/Q2JH3M1S