BDBM50255032 CHEMBL465740::N-((R)-2-((S)-2-(benzo[d]oxazol-2-yl)pyrrolidine-1-carbonyl)heptyl)-N-hydroxyformamide
SMILES: CCCCC[C@H](CN(O)C=O)C(=O)N1CCC[C@H]1c1nc2ccccc2o1
InChI Key: InChIKey=MRDSCHQXYLDNSX-WBVHZDCISA-N
Data: 1 IC50
Activity Spreadsheet -- Enzyme Inhibition Constant Data from BindingDB
Found 1 hit for monomerid = 50255032
Trg + Lig
Ki
nM
ΔG°
kcal/mole
IC50
nM
Kd
nM
EC50/IC50
nM
koff
s-1
kon
M-1s-1
pHTemp
°C
Peptide deformylase
(Mycobacterium tuberculosis)
BDBM50255032
(CHEMBL465740 | N-((R)-2-((S)-2-(benzo[d]oxazol-2-y...)
Show SMILES CCCCC[C@H](CN(O)C=O)C(=O)N1CCC[C@H]1c1nc2ccccc2o1 |r|
Show InChI InChI=1S/C20H27N3O4/c1-2-3-4-8-15(13-22(26)14-24)20(25)23-12-7-10-17(23)19-21-16-9-5-6-11-18(16)27-19/h5-6,9,11,14-15,17,26H,2-4,7-8,10,12-13H2,1H3/t15-,17+/m1/s1
n/an/a 13n/an/an/an/an/an/a
Novartis Institute for Tropical Diseases
Curated by ChEMBL
Assay Description
Inhibition of Mycobacterium tuberculosis peptide deformylase expressed in Escherichia coli M15(pREp4) by microplate assay
Bioorg Med Chem Lett 18: 6568-72 (2008)
Article DOI: 10.1016/j.bmcl.2008.10.040
BindingDB Entry DOI: 10.7270/Q2VX0GCD
3D
3D Structure (docked)