BDBM50255033 CHEMBL463859::N-((R)-3-((S)-2-(benzo[d]oxazol-2-yl)pyrrolidin-1-yl)-2-(cyclopropylmethyl)-3-oxopropyl)-N-hydroxyformamide
SMILES: ON(C[C@@H](CC1CC1)C(=O)N1CCC[C@H]1c1nc2ccccc2o1)C=O
InChI Key: InChIKey=DPXBZUPCBINZLE-ZBFHGGJFSA-N
Data: 1 IC50
Activity Spreadsheet -- Enzyme Inhibition Constant Data from BindingDB
Found 1 hit for monomerid = 50255033
Trg + Lig
Ki
nM
ΔG°
kcal/mole
IC50
nM
Kd
nM
EC50/IC50
nM
koff
s-1
kon
M-1s-1
pHTemp
°C
Peptide deformylase
(Mycobacterium tuberculosis)
BDBM50255033
(CHEMBL463859 | N-((R)-3-((S)-2-(benzo[d]oxazol-2-y...)
Show SMILES ON(C[C@@H](CC1CC1)C(=O)N1CCC[C@H]1c1nc2ccccc2o1)C=O |r|
Show InChI InChI=1S/C19H23N3O4/c23-12-21(25)11-14(10-13-7-8-13)19(24)22-9-3-5-16(22)18-20-15-4-1-2-6-17(15)26-18/h1-2,4,6,12-14,16,25H,3,5,7-11H2/t14-,16+/m1/s1
n/an/a 21n/an/an/an/an/an/a
Novartis Institute for Tropical Diseases
Curated by ChEMBL
Assay Description
Inhibition of Mycobacterium tuberculosis peptide deformylase expressed in Escherichia coli M15(pREp4) by microplate assay
Bioorg Med Chem Lett 18: 6568-72 (2008)
Article DOI: 10.1016/j.bmcl.2008.10.040
BindingDB Entry DOI: 10.7270/Q2VX0GCD