BDBM50255067 (S)-N-(2'-oxo-1,1',2',3-tetrahydrospiro[indene-2,3'-pyrrolo[2,3-b]pyridine]-5-yl)-2-(2-oxo-3-(tetrahydro-2H-thiopyran-4-yl)-2,3-dihydro-1H-benzo[d]imidazol-1-yl)acetamide::CHEMBL464078
SMILES: O=C(Cn1c2ccccc2n(C2CCSCC2)c1=O)Nc1ccc2C[C@@]3(Cc2c1)C(=O)Nc1ncccc31
InChI Key: InChIKey=IISUECSUWJMYQX-LJAQVGFWSA-N
Data: 1 KI  2 IC50
Activity Spreadsheet -- Enzyme Inhibition Constant Data from BindingDB
Found 3 hits for monomerid = 50255067
Trg + Lig
Ki
nM
ΔG°
kcal/mole
IC50
nM
Kd
nM
EC50/IC50
nM
koff
s-1
kon
M-1s-1
pHTemp
°C
Calcitonin gene-related peptide type 1 receptor
(Homo sapiens (Human))
BDBM50255067
((S)-N-(2'-oxo-1,1',2',3-tetrahydrospiro[indene-2,3...)
Show SMILES O=C(Cn1c2ccccc2n(C2CCSCC2)c1=O)Nc1ccc2C[C@@]3(Cc2c1)C(=O)Nc1ncccc31 |r|
Show InChI InChI=1S/C29H27N5O3S/c35-25(17-33-23-5-1-2-6-24(23)34(28(33)37)21-9-12-38-13-10-21)31-20-8-7-18-15-29(16-19(18)14-20)22-4-3-11-30-26(22)32-27(29)36/h1-8,11,14,21H,9-10,12-13,15-17H2,(H,31,35)(H,30,32,36)/t29-/m0/s1
Reactome pathway
0.870n/an/an/an/an/an/an/an/a
Merck& Co
Curated by ChEMBL
Assay Description
Displacement of [125I]hCGRP from human CGRP receptor expressed in HEK293 cells coexpressing RAMP1
Bioorg Med Chem Lett 19: 214-7 (2008)
Article DOI: 10.1016/j.bmcl.2008.10.106
BindingDB Entry DOI: 10.7270/Q21C1XSK
Calcitonin gene-related peptide type 1 receptor
(Homo sapiens (Human))
BDBM50255067
((S)-N-(2'-oxo-1,1',2',3-tetrahydrospiro[indene-2,3...)
Show SMILES O=C(Cn1c2ccccc2n(C2CCSCC2)c1=O)Nc1ccc2C[C@@]3(Cc2c1)C(=O)Nc1ncccc31 |r|
Show InChI InChI=1S/C29H27N5O3S/c35-25(17-33-23-5-1-2-6-24(23)34(28(33)37)21-9-12-38-13-10-21)31-20-8-7-18-15-29(16-19(18)14-20)22-4-3-11-30-26(22)32-27(29)36/h1-8,11,14,21H,9-10,12-13,15-17H2,(H,31,35)(H,30,32,36)/t29-/m0/s1
Reactome pathway
n/an/a 2.5n/an/an/an/an/an/a
Merck& Co
Curated by ChEMBL
Assay Description
Antagonistic activity at human CGRP receptor expressed in HEK293 cells coexpressing RAMP1 assessed as inhibition of CGRP-induced cAMP production
Bioorg Med Chem Lett 19: 214-7 (2008)
Article DOI: 10.1016/j.bmcl.2008.10.106
BindingDB Entry DOI: 10.7270/Q21C1XSK
Calcitonin gene-related peptide type 1 receptor
(Homo sapiens (Human))
BDBM50255067
((S)-N-(2'-oxo-1,1',2',3-tetrahydrospiro[indene-2,3...)
Show SMILES O=C(Cn1c2ccccc2n(C2CCSCC2)c1=O)Nc1ccc2C[C@@]3(Cc2c1)C(=O)Nc1ncccc31 |r|
Show InChI InChI=1S/C29H27N5O3S/c35-25(17-33-23-5-1-2-6-24(23)34(28(33)37)21-9-12-38-13-10-21)31-20-8-7-18-15-29(16-19(18)14-20)22-4-3-11-30-26(22)32-27(29)36/h1-8,11,14,21H,9-10,12-13,15-17H2,(H,31,35)(H,30,32,36)/t29-/m0/s1
Reactome pathway
n/an/a 24n/an/an/an/an/an/a
Merck& Co
Curated by ChEMBL
Assay Description
Antagonistic activity at human CGRP receptor expressed in HEK293 cells coexpressing RAMP1 assessed as inhibition of CGRP-induced cAMP production in p...
Bioorg Med Chem Lett 19: 214-7 (2008)
Article DOI: 10.1016/j.bmcl.2008.10.106
BindingDB Entry DOI: 10.7270/Q21C1XSK