BDBM50255092 2-(3-(2,4-dichlorophenylsulfonyl)-1H-indol-4-yloxy)-N-(4,5-dichlorothiophen-2-ylsulfonyl)acetamide::CHEMBL480609
SMILES: Clc1cc(sc1Cl)S(=O)(=O)NC(=O)COc1cccc2[nH]cc(c12)S(=O)(=O)c1ccc(Cl)cc1Cl
InChI Key: InChIKey=OFPPBUAABJHCMT-UHFFFAOYSA-N
Data: 2 IC50
Activity Spreadsheet -- Enzyme Inhibition Constant Data from BindingDB
Found 2 hits for monomerid = 50255092
Trg + Lig
Ki
nM
ΔG°
kcal/mole
IC50
nM
Kd
nM
EC50/IC50
nM
koff
s-1
kon
M-1s-1
pHTemp
°C
Prostaglandin E2 receptor
(Homo sapiens (Human))
BDBM50255092
(2-(3-(2,4-dichlorophenylsulfonyl)-1H-indol-4-yloxy...)
Show SMILES Clc1cc(sc1Cl)S(=O)(=O)NC(=O)COc1cccc2[nH]cc(c12)S(=O)(=O)c1ccc(Cl)cc1Cl
Show InChI InChI=1S/C20H12Cl4N2O6S3/c21-10-4-5-15(11(22)6-10)34(28,29)16-8-25-13-2-1-3-14(19(13)16)32-9-17(27)26-35(30,31)18-7-12(23)20(24)33-18/h1-8,25H,9H2,(H,26,27)
n/an/a 44.8n/an/an/an/an/an/a
deCODE Chemistry, Inc
Curated by ChEMBL
Assay Description
Displacement of [3H]PGE2 from human EP3 receptor
Bioorg Med Chem Lett 19: 123-6 (2008)
Article DOI: 10.1016/j.bmcl.2008.11.007
BindingDB Entry DOI: 10.7270/Q2JH3M1S
Prostaglandin E2 receptor
(Homo sapiens (Human))
BDBM50255092
(2-(3-(2,4-dichlorophenylsulfonyl)-1H-indol-4-yloxy...)
Show SMILES Clc1cc(sc1Cl)S(=O)(=O)NC(=O)COc1cccc2[nH]cc(c12)S(=O)(=O)c1ccc(Cl)cc1Cl
Show InChI InChI=1S/C20H12Cl4N2O6S3/c21-10-4-5-15(11(22)6-10)34(28,29)16-8-25-13-2-1-3-14(19(13)16)32-9-17(27)26-35(30,31)18-7-12(23)20(24)33-18/h1-8,25H,9H2,(H,26,27)
n/an/a 5.60n/an/an/an/an/an/a
deCODE Chemistry, Inc
Curated by ChEMBL
Assay Description
Displacement of [3H]PGE2 from human EP3 receptor in presence of 10% human serum
Bioorg Med Chem Lett 19: 123-6 (2008)
Article DOI: 10.1016/j.bmcl.2008.11.007
BindingDB Entry DOI: 10.7270/Q2JH3M1S