BDBM50255262 CHEMBL479279::N-(2-aminophenyl)-4-((4-(6-(4-methylpiperazin-1-yl)pyridin-3-yl)pyrimidin-2-ylamino)methyl)benzamide
SMILES: CN1CCN(CC1)c1ccc(cn1)-c1ccnc(NCc2ccc(cc2)C(=O)Nc2ccccc2N)n1
InChI Key: InChIKey=FAXVPGVAXAHKSU-UHFFFAOYSA-N
Data: 1 IC50
Activity Spreadsheet -- Enzyme Inhibition Constant Data from BindingDB
Found 1 hit for monomerid = 50255262
Trg + Lig
Ki
nM
ΔG°
kcal/mole
IC50
nM
Kd
nM
EC50/IC50
nM
koff
s-1
kon
M-1s-1
pHTemp
°C
Histone deacetylase 1
(Homo sapiens (Human))
BDBM50255262
(CHEMBL479279 | N-(2-aminophenyl)-4-((4-(6-(4-methy...)
Show SMILES CN1CCN(CC1)c1ccc(cn1)-c1ccnc(NCc2ccc(cc2)C(=O)Nc2ccccc2N)n1
Show InChI InChI=1S/C28H30N8O/c1-35-14-16-36(17-15-35)26-11-10-22(19-31-26)24-12-13-30-28(34-24)32-18-20-6-8-21(9-7-20)27(37)33-25-5-3-2-4-23(25)29/h2-13,19H,14-18,29H2,1H3,(H,33,37)(H,30,32,34)
NCI pathway
Reactome pathway
n/an/a 80n/an/an/an/an/an/a
MethylGene Inc.
Curated by ChEMBL
Assay Description
Inhibition of human recombinant HDAC1
Bioorg Med Chem Lett 19: 644-9 (2009)
Article DOI: 10.1016/j.bmcl.2008.12.048
BindingDB Entry DOI: 10.7270/Q2PN95J1