BDBM50255474 4-(5-(3-(4-bromophenyl)benzo[d]isothiazol-6-yl)pentyl)morpholine::CHEMBL516750
SMILES: Brc1ccc(cc1)-c1nsc2cc(CCCCCN3CCOCC3)ccc12
InChI Key: InChIKey=CMTFYZXNPSNMTR-UHFFFAOYSA-N
Data: 3 IC50
Activity Spreadsheet -- Enzyme Inhibition Constant Data from BindingDB
Found 3 hits for monomerid = 50255474
Trg + Lig
Ki
nM
ΔG°
kcal/mole
IC50
nM
Kd
nM
EC50/IC50
nM
koff
s-1
kon
M-1s-1
pHTemp
°C
Lanosterol synthase
(Homo sapiens (Human))
BDBM50255474
(4-(5-(3-(4-bromophenyl)benzo[d]isothiazol-6-yl)pen...)
Show SMILES Brc1ccc(cc1)-c1nsc2cc(CCCCCN3CCOCC3)ccc12
Show InChI InChI=1S/C22H25BrN2OS/c23-19-8-6-18(7-9-19)22-20-10-5-17(16-21(20)27-24-22)4-2-1-3-11-25-12-14-26-15-13-25/h5-10,16H,1-4,11-15H2
Reactome pathway
n/an/a 100n/an/an/an/an/an/a
Università di Torino
Curated by ChEMBL
Assay Description
Inhibition of human OSC expressed in Saccharomyces cerevisiae SMY8
Bioorg Med Chem Lett 19: 718-23 (2009)
Article DOI: 10.1016/j.bmcl.2008.12.040
BindingDB Entry DOI: 10.7270/Q2SF2W2N
Cycloartenol synthase
(Arabidopsis thaliana)
BDBM50255474
(4-(5-(3-(4-bromophenyl)benzo[d]isothiazol-6-yl)pen...)
Show SMILES Brc1ccc(cc1)-c1nsc2cc(CCCCCN3CCOCC3)ccc12
Show InChI InChI=1S/C22H25BrN2OS/c23-19-8-6-18(7-9-19)22-20-10-5-17(16-21(20)27-24-22)4-2-1-3-11-25-12-14-26-15-13-25/h5-10,16H,1-4,11-15H2
Reactome pathway
n/an/a 650n/an/an/an/an/an/a
Università di Torino
Curated by ChEMBL
Assay Description
Inhibition of Arabidopsis thaliana cycloartenol synthase expressed in Saccharomyces cerevisiae SMY8
Bioorg Med Chem Lett 19: 718-23 (2009)
Article DOI: 10.1016/j.bmcl.2008.12.040
BindingDB Entry DOI: 10.7270/Q2SF2W2N
Lanosterol synthase
(Saccharomyces cerevisiae)
BDBM50255474
(4-(5-(3-(4-bromophenyl)benzo[d]isothiazol-6-yl)pen...)
Show SMILES Brc1ccc(cc1)-c1nsc2cc(CCCCCN3CCOCC3)ccc12
Show InChI InChI=1S/C22H25BrN2OS/c23-19-8-6-18(7-9-19)22-20-10-5-17(16-21(20)27-24-22)4-2-1-3-11-25-12-14-26-15-13-25/h5-10,16H,1-4,11-15H2
Reactome pathway
n/an/a 400n/an/an/an/an/an/a
Università di Torino
Curated by ChEMBL
Assay Description
Inhibition of yeast OSC expressed in Saccharomyces cerevisiae SMY8
Bioorg Med Chem Lett 19: 718-23 (2009)
Article DOI: 10.1016/j.bmcl.2008.12.040
BindingDB Entry DOI: 10.7270/Q2SF2W2N