BDBM50255631 CHEMBL516922::N-[(1R,2R,5S)-2-{[(5-Chloroindol-2-yl)carbonyl]amino}-5-(dimethylcarbamoyl)cyclohexyl]-5-methyl-4,5,6,7tetrahydrothiazolo[5,4-c]pyridine-2-carboxamide
SMILES: CN(C)C(=O)[C@H]1CC[C@@H](NC(=O)c2cc3cc(Cl)ccc3[nH]2)[C@@H](C1)NC(=O)c1nc2CCN(C)Cc2s1
InChI Key: InChIKey=SZBHQQIIGORYND-BOUXLOLZSA-N
Data: 1 IC50
Activity Spreadsheet -- Enzyme Inhibition Constant Data from BindingDB
Found 1 hit for monomerid = 50255631
Trg + Lig
Ki
nM
ΔG°
kcal/mole
IC50
nM
Kd
nM
EC50/IC50
nM
koff
s-1
kon
M-1s-1
pHTemp
°C
Coagulation factor X
(Homo sapiens (Human))
BDBM50255631
(CHEMBL516922 | N-[(1R,2R,5S)-2-{[(5-Chloroindol-2-...)
Show SMILES CN(C)C(=O)[C@H]1CC[C@@H](NC(=O)c2cc3cc(Cl)ccc3[nH]2)[C@@H](C1)NC(=O)c1nc2CCN(C)Cc2s1 |r|
Show InChI InChI=1S/C26H31ClN6O3S/c1-32(2)26(36)14-4-6-18(29-23(34)21-12-15-10-16(27)5-7-17(15)28-21)20(11-14)30-24(35)25-31-19-8-9-33(3)13-22(19)37-25/h5,7,10,12,14,18,20,28H,4,6,8-9,11,13H2,1-3H3,(H,29,34)(H,30,35)/t14-,18+,20+/m0/s1
Reactome pathway
n/an/a 1.80n/an/an/an/an/an/a
Daiichi Sankyo Co., Ltd.
Curated by ChEMBL
Assay Description
Inhibition of human factor 10a
Bioorg Med Chem 17: 1193-206 (2009)
Article DOI: 10.1016/j.bmc.2008.12.037
BindingDB Entry DOI: 10.7270/Q2V69JGR