null
SMILES: CC(C)C[C@H](NC(=O)[C@@H](NC(=O)CNC(=O)c1ccccc1)C(C)C)C(=O)N[C@@H](CCCCNC(=O)CC(SCCc1cnccn1)C(O)=O)C(=O)N[C@@H](CCC(O)=O)C(=O)N[C@@H](Cc1ccc(O)cc1)C(=O)NCC(=O)N[C@@H](C(C)C)C(N)=O
InChI Key: InChIKey=VBSIMNWXEQHINE-XACDURMXSA-N
Activity Spreadsheet -- Enzyme Inhibition Constant Data from BindingDB
Found 2 hits for monomerid = 50255690
Trg + Lig
Ki
nM
ΔG°
kcal/mole
IC50
nM
Kd
nM
EC50/IC50
nM
koff
s-1
kon
M-1s-1
pHTemp
°C
NAD-dependent protein deacylase sirtuin-5, mitochondrial
(Homo sapiens (Human))
BDBM50255690
(CHEMBL4068735)
Show SMILES CC(C)C[C@H](NC(=O)[C@@H](NC(=O)CNC(=O)c1ccccc1)C(C)C)C(=O)N[C@@H](CCCCNC(=O)CC(SCCc1cnccn1)C(O)=O)C(=O)N[C@@H](CCC(O)=O)C(=O)N[C@@H](Cc1ccc(O)cc1)C(=O)NCC(=O)N[C@@H](C(C)C)C(N)=O |r|
Show InChI InChI=1S/C57H80N12O15S/c1-32(2)26-41(67-56(82)49(34(5)6)69-46(73)30-62-51(77)36-12-8-7-9-13-36)55(81)64-39(14-10-11-22-61-44(71)28-43(57(83)84)85-25-21-37-29-59-23-24-60-37)53(79)65-40(19-20-47(74)75)54(80)66-42(27-35-15-17-38(70)18-16-35)52(78)63-31-45(72)68-48(33(3)4)50(58)76/h7-9,12-13,15-18,23-24,29,32-34,39-43,48-49,70H,10-11,14,19-22,25-28,30-31H2,1-6H3,(H2,58,76)(H,61,71)(H,62,77)(H,63,78)(H,64,81)(H,65,79)(H,66,80)(H,67,82)(H,68,72)(H,69,73)(H,74,75)(H,83,84)/t39-,40-,41-,42-,43?,48-,49-/m0/s1
3.5n/an/an/an/an/an/an/an/a
Department of Enzymology, Institute of Biochemistry and Biotechnology , Martin-Luther-University Halle-Wittenberg , 06120 Halle/Saale , Germany.
Curated by ChEMBL
Assay Description
Inhibition of human recombinant N-terminal Strep2-tagged SIRT5 expressed in Escherichia coli BL21 (DE3) using Abz-GVLK(glutaryl)AY(NO2)GV-NH2 as subs...
J Med Chem 61: 2460-2471 (2018)
Article DOI: 10.1021/acs.jmedchem.7b01648
BindingDB Entry DOI: 10.7270/Q2WW7M4J
NAD-dependent protein deacylase sirtuin-5, mitochondrial
(Homo sapiens (Human))
BDBM50255690
(CHEMBL4068735)
Show SMILES CC(C)C[C@H](NC(=O)[C@@H](NC(=O)CNC(=O)c1ccccc1)C(C)C)C(=O)N[C@@H](CCCCNC(=O)CC(SCCc1cnccn1)C(O)=O)C(=O)N[C@@H](CCC(O)=O)C(=O)N[C@@H](Cc1ccc(O)cc1)C(=O)NCC(=O)N[C@@H](C(C)C)C(N)=O |r|
Show InChI InChI=1S/C57H80N12O15S/c1-32(2)26-41(67-56(82)49(34(5)6)69-46(73)30-62-51(77)36-12-8-7-9-13-36)55(81)64-39(14-10-11-22-61-44(71)28-43(57(83)84)85-25-21-37-29-59-23-24-60-37)53(79)65-40(19-20-47(74)75)54(80)66-42(27-35-15-17-38(70)18-16-35)52(78)63-31-45(72)68-48(33(3)4)50(58)76/h7-9,12-13,15-18,23-24,29,32-34,39-43,48-49,70H,10-11,14,19-22,25-28,30-31H2,1-6H3,(H2,58,76)(H,61,71)(H,62,77)(H,63,78)(H,64,81)(H,65,79)(H,66,80)(H,67,82)(H,68,72)(H,69,73)(H,74,75)(H,83,84)/t39-,40-,41-,42-,43?,48-,49-/m0/s1
n/an/a 2.28E+4n/an/an/an/an/an/a
Department of Enzymology, Institute of Biochemistry and Biotechnology , Martin-Luther-University Halle-Wittenberg , 06120 Halle/Saale , Germany.
Curated by ChEMBL
Assay Description
Inhibition of recombinant human N-terminal His-tagged SIRT5 (34 to 269 residues) expressed in Escherichia coli Transetta(DE3) cells using Benzyl Lys(...
J Med Chem 61: 2460-2471 (2018)
Article DOI: 10.1021/acs.jmedchem.7b01648
BindingDB Entry DOI: 10.7270/Q2WW7M4J