null
SMILES: CCOc1cc2ncc(C(N)=O)c(Nc3cccc(Cl)c3Cl)c2cc1NCCN1CCCCC1
InChI Key: InChIKey=YPXKZNDCBYWMOG-UHFFFAOYSA-N
Activity Spreadsheet -- Enzyme Inhibition Constant Data from BindingDB
Found 1 hit for monomerid = 50255698
Trg + Lig
Ki
nM
ΔG°
kcal/mole
IC50
nM
Kd
nM
EC50/IC50
nM
koff
s-1
kon
M-1s-1
pHTemp
°C
Macrophage colony-stimulating factor 1 receptor
(Homo sapiens (Human))
BDBM50255698
(4-(2,3-dichlorophenylamino)-7-ethoxy-6-(2-(piperid...)
Show SMILES CCOc1cc2ncc(C(N)=O)c(Nc3cccc(Cl)c3Cl)c2cc1NCCN1CCCCC1
Show InChI InChI=1S/C25H29Cl2N5O2/c1-2-34-22-14-20-16(13-21(22)29-9-12-32-10-4-3-5-11-32)24(17(15-30-20)25(28)33)31-19-8-6-7-18(26)23(19)27/h6-8,13-15,29H,2-5,9-12H2,1H3,(H2,28,33)(H,30,31)
n/an/a 6n/an/an/an/an/an/a
AstraZeneca R&D Boston
Curated by ChEMBL
Assay Description
Inhibition of His-tagged CSF1R catalytic domain (unknown origin) expressed in baculovirus by HTRF assay
Bioorg Med Chem Lett 19: 697-700 (2009)
Article DOI: 10.1016/j.bmcl.2008.12.046
BindingDB Entry DOI: 10.7270/Q26M36P8