BDBM50256016 CHEMBL475768::N-(3-chloro-4-(3-fluorobenzyloxy)phenyl)-6-(5-((2-(methylsulfonyl)ethylamino)methyl)furan-2-yl)thieno[3,2-d]pyrimidin-4-amine
SMILES: CS(=O)(=O)CCNCc1ccc(o1)-c1cc2ncnc(Nc3ccc(OCc4cccc(F)c4)c(Cl)c3)c2s1
InChI Key: InChIKey=XYUIVHYWMAPVBZ-UHFFFAOYSA-N
Data: 2 IC50
Activity Spreadsheet -- Enzyme Inhibition Constant Data from BindingDB
Found 2 hits for monomerid = 50256016
Trg + Lig
Ki
nM
ΔG°
kcal/mole
IC50
nM
Kd
nM
EC50/IC50
nM
koff
s-1
kon
M-1s-1
pHTemp
°C
Epidermal growth factor receptor
(Homo sapiens (Human))
BDBM50256016
(CHEMBL475768 | N-(3-chloro-4-(3-fluorobenzyloxy)ph...)
Show SMILES CS(=O)(=O)CCNCc1ccc(o1)-c1cc2ncnc(Nc3ccc(OCc4cccc(F)c4)c(Cl)c3)c2s1
Show InChI InChI=1S/C27H24ClFN4O4S2/c1-39(34,35)10-9-30-14-20-6-8-24(37-20)25-13-22-26(38-25)27(32-16-31-22)33-19-5-7-23(21(28)12-19)36-15-17-3-2-4-18(29)11-17/h2-8,11-13,16,30H,9-10,14-15H2,1H3,(H,31,32,33)
n/an/a 1n/an/an/an/an/an/a
GlaxoSmithKline
Curated by ChEMBL
Assay Description
Inhibition of EGFR
Bioorg Med Chem Lett 19: 817-20 (2009)
Article DOI: 10.1016/j.bmcl.2008.12.011
BindingDB Entry DOI: 10.7270/Q2TH8NNN
Receptor tyrosine-protein kinase erbB-2
(Homo sapiens (Human))
BDBM50256016
(CHEMBL475768 | N-(3-chloro-4-(3-fluorobenzyloxy)ph...)
Show SMILES CS(=O)(=O)CCNCc1ccc(o1)-c1cc2ncnc(Nc3ccc(OCc4cccc(F)c4)c(Cl)c3)c2s1
Show InChI InChI=1S/C27H24ClFN4O4S2/c1-39(34,35)10-9-30-14-20-6-8-24(37-20)25-13-22-26(38-25)27(32-16-31-22)33-19-5-7-23(21(28)12-19)36-15-17-3-2-4-18(29)11-17/h2-8,11-13,16,30H,9-10,14-15H2,1H3,(H,31,32,33)
n/an/a 71n/an/an/an/an/an/a
GlaxoSmithKline
Curated by ChEMBL
Assay Description
Inhibition of ErbB2
Bioorg Med Chem Lett 19: 817-20 (2009)
Article DOI: 10.1016/j.bmcl.2008.12.011
BindingDB Entry DOI: 10.7270/Q2TH8NNN