BDBM50256036 CHEMBL474431::N-(3-chloro-4-(3-fluorobenzyloxy)phenyl)-6-(5-((2-(methylsulfonyl)ethylamino)methyl)thiophen-3-yl)thieno[3,2-d]pyrimidin-4-amine::TCMDC-138726
SMILES: CS(=O)(=O)CCNCc1cc(cs1)-c1cc2ncnc(Nc3ccc(OCc4cccc(F)c4)c(Cl)c3)c2s1
InChI Key: InChIKey=RAKHTNLGXMUAQG-UHFFFAOYSA-N
Data: 2 IC50
Activity Spreadsheet -- Enzyme Inhibition Constant Data from BindingDB
Found 2 hits for monomerid = 50256036
Trg + Lig
Ki
nM
ΔG°
kcal/mole
IC50
nM
Kd
nM
EC50/IC50
nM
koff
s-1
kon
M-1s-1
pHTemp
°C
Epidermal growth factor receptor
(Homo sapiens (Human))
BDBM50256036
(CHEMBL474431 | N-(3-chloro-4-(3-fluorobenzyloxy)ph...)
Show SMILES CS(=O)(=O)CCNCc1cc(cs1)-c1cc2ncnc(Nc3ccc(OCc4cccc(F)c4)c(Cl)c3)c2s1
Show InChI InChI=1S/C27H24ClFN4O3S3/c1-39(34,35)8-7-30-13-21-10-18(15-37-21)25-12-23-26(38-25)27(32-16-31-23)33-20-5-6-24(22(28)11-20)36-14-17-3-2-4-19(29)9-17/h2-6,9-12,15-16,30H,7-8,13-14H2,1H3,(H,31,32,33)
n/an/a 3n/an/an/an/an/an/a
GlaxoSmithKline
Curated by ChEMBL
Assay Description
Inhibition of EGFR
Bioorg Med Chem Lett 19: 817-20 (2009)
Article DOI: 10.1016/j.bmcl.2008.12.011
BindingDB Entry DOI: 10.7270/Q2TH8NNN
Receptor tyrosine-protein kinase erbB-2
(Homo sapiens (Human))
BDBM50256036
(CHEMBL474431 | N-(3-chloro-4-(3-fluorobenzyloxy)ph...)
Show SMILES CS(=O)(=O)CCNCc1cc(cs1)-c1cc2ncnc(Nc3ccc(OCc4cccc(F)c4)c(Cl)c3)c2s1
Show InChI InChI=1S/C27H24ClFN4O3S3/c1-39(34,35)8-7-30-13-21-10-18(15-37-21)25-12-23-26(38-25)27(32-16-31-23)33-20-5-6-24(22(28)11-20)36-14-17-3-2-4-19(29)9-17/h2-6,9-12,15-16,30H,7-8,13-14H2,1H3,(H,31,32,33)
n/an/a 31n/an/an/an/an/an/a
GlaxoSmithKline
Curated by ChEMBL
Assay Description
Inhibition of ErbB2
Bioorg Med Chem Lett 19: 817-20 (2009)
Article DOI: 10.1016/j.bmcl.2008.12.011
BindingDB Entry DOI: 10.7270/Q2TH8NNN