BDBM50256038 CHEMBL473437::N-(3-chloro-4-(3-fluorobenzyloxy)phenyl)-6-(5-((dimethylamino)methyl)-1H-pyrrol-2-yl)thieno[3,2-d]pyrimidin-4-amine::TCMDC-135507
SMILES: CN(C)Cc1ccc([nH]1)-c1cc2ncnc(Nc3ccc(OCc4cccc(F)c4)c(Cl)c3)c2s1
InChI Key: InChIKey=ATEQNOXHLBHSBB-UHFFFAOYSA-N
Data: 2 IC50
Activity Spreadsheet -- Enzyme Inhibition Constant Data from BindingDB
Found 2 hits for monomerid = 50256038
Trg + Lig
Ki
nM
ΔG°
kcal/mole
IC50
nM
Kd
nM
EC50/IC50
nM
koff
s-1
kon
M-1s-1
pHTemp
°C
Epidermal growth factor receptor
(Homo sapiens (Human))
BDBM50256038
(CHEMBL473437 | N-(3-chloro-4-(3-fluorobenzyloxy)ph...)
Show SMILES CN(C)Cc1ccc([nH]1)-c1cc2ncnc(Nc3ccc(OCc4cccc(F)c4)c(Cl)c3)c2s1
Show InChI InChI=1S/C26H23ClFN5OS/c1-33(2)13-19-6-8-21(31-19)24-12-22-25(35-24)26(30-15-29-22)32-18-7-9-23(20(27)11-18)34-14-16-4-3-5-17(28)10-16/h3-12,15,31H,13-14H2,1-2H3,(H,29,30,32)
n/an/a 4n/an/an/an/an/an/a
GlaxoSmithKline
Curated by ChEMBL
Assay Description
Inhibition of EGFR
Bioorg Med Chem Lett 19: 817-20 (2009)
Article DOI: 10.1016/j.bmcl.2008.12.011
BindingDB Entry DOI: 10.7270/Q2TH8NNN
Receptor tyrosine-protein kinase erbB-2
(Homo sapiens (Human))
BDBM50256038
(CHEMBL473437 | N-(3-chloro-4-(3-fluorobenzyloxy)ph...)
Show SMILES CN(C)Cc1ccc([nH]1)-c1cc2ncnc(Nc3ccc(OCc4cccc(F)c4)c(Cl)c3)c2s1
Show InChI InChI=1S/C26H23ClFN5OS/c1-33(2)13-19-6-8-21(31-19)24-12-22-25(35-24)26(30-15-29-22)32-18-7-9-23(20(27)11-18)34-14-16-4-3-5-17(28)10-16/h3-12,15,31H,13-14H2,1-2H3,(H,29,30,32)
n/an/a 76n/an/an/an/an/an/a
GlaxoSmithKline
Curated by ChEMBL
Assay Description
Inhibition of ErbB2
Bioorg Med Chem Lett 19: 817-20 (2009)
Article DOI: 10.1016/j.bmcl.2008.12.011
BindingDB Entry DOI: 10.7270/Q2TH8NNN