BDBM50256043 (Z)-3-bromohymenialdisine::CHEMBL480350::Hymenialdisine, 10
SMILES: NC1=NC(C(=O)N1)=C1CCNC(=O)c2[nH]c(Br)c(Br)c12
InChI Key: InChIKey=ZITKTAJHKVYGTC-UHFFFAOYSA-N
Data: 4 IC50
Activity Spreadsheet -- Enzyme Inhibition Constant Data from BindingDB
Found 4 hits for monomerid = 50256043
Trg + Lig
Ki
nM
ΔG°
kcal/mole
IC50
nM
Kd
nM
EC50/IC50
nM
koff
s-1
kon
M-1s-1
pHTemp
°C
Cyclin-dependent kinase 5 regulatory subunit 1
(Homo sapiens (Human))
BDBM50256043
((Z)-3-bromohymenialdisine | CHEMBL480350 | Hymenia...)
Show SMILES NC1=NC(C(=O)N1)=C1CCNC(=O)c2[nH]c(Br)c(Br)c12 |w:3.2,t:1|
Show InChI InChI=1S/C11H9Br2N5O2/c12-5-4-3(6-10(20)18-11(14)17-6)1-2-15-9(19)7(4)16-8(5)13/h16H,1-2H2,(H,15,19)(H3,14,17,18,20)
NCI pathway
Reactome pathway
n/an/a 56n/an/an/an/a7.2n/a
Genomics Institute of the Novartis Research Foundation
Assay Description
In vitro kinase assay using SPA assay kit from Amersham Pharmacia Biotech, Uk.
Chem Biol 11: 247-59 (2004)
Article DOI: 10.1016/j.chembiol.2004.01.015
BindingDB Entry DOI: 10.7270/Q2FN14M9
Serine/threonine-protein kinase Chk1
(Homo sapiens (Human))
BDBM50256043
((Z)-3-bromohymenialdisine | CHEMBL480350 | Hymenia...)
Show SMILES NC1=NC(C(=O)N1)=C1CCNC(=O)c2[nH]c(Br)c(Br)c12 |w:3.2,t:1|
Show InChI InChI=1S/C11H9Br2N5O2/c12-5-4-3(6-10(20)18-11(14)17-6)1-2-15-9(19)7(4)16-8(5)13/h16H,1-2H2,(H,15,19)(H3,14,17,18,20)
Reactome pathway
n/an/a 100n/an/an/an/an/an/a
Institut de Recherche Servier
Curated by ChEMBL
Assay Description
Inhibition of CHK1
Bioorg Med Chem Lett 19: 841-4 (2009)
Article DOI: 10.1016/j.bmcl.2008.12.001
BindingDB Entry DOI: 10.7270/Q2QN66MH
Glycogen synthase kinase-3 beta
(Homo sapiens (Human))
BDBM50256043
((Z)-3-bromohymenialdisine | CHEMBL480350 | Hymenia...)
Show SMILES NC1=NC(C(=O)N1)=C1CCNC(=O)c2[nH]c(Br)c(Br)c12 |w:3.2,t:1|
Show InChI InChI=1S/C11H9Br2N5O2/c12-5-4-3(6-10(20)18-11(14)17-6)1-2-15-9(19)7(4)16-8(5)13/h16H,1-2H2,(H,15,19)(H3,14,17,18,20)
NCI pathway
Reactome pathway
n/an/a 51n/an/an/an/a7.2n/a
Genomics Institute of the Novartis Research Foundation
Assay Description
In vitro kinase assay using SPA assay kit from Amersham Pharmacia Biotech, Uk.
Chem Biol 11: 247-59 (2004)
Article DOI: 10.1016/j.chembiol.2004.01.015
BindingDB Entry DOI: 10.7270/Q2FN14M9
Cyclin-dependent kinase 1
(Homo sapiens (Human))
BDBM50256043
((Z)-3-bromohymenialdisine | CHEMBL480350 | Hymenia...)
Show SMILES NC1=NC(C(=O)N1)=C1CCNC(=O)c2[nH]c(Br)c(Br)c12 |w:3.2,t:1|
Show InChI InChI=1S/C11H9Br2N5O2/c12-5-4-3(6-10(20)18-11(14)17-6)1-2-15-9(19)7(4)16-8(5)13/h16H,1-2H2,(H,15,19)(H3,14,17,18,20)
Reactome pathway
n/an/a 530n/an/an/an/a7.2n/a
Genomics Institute of the Novartis Research Foundation
Assay Description
In vitro kinase assay using SPA assay kit from Amersham Pharmacia Biotech, Uk.
Chem Biol 11: 247-59 (2004)
Article DOI: 10.1016/j.chembiol.2004.01.015
BindingDB Entry DOI: 10.7270/Q2FN14M9