BDBM50256176 6-(4-chloro-N-(5,5,8,8-tetramethyl-5,6,7,8-tetrahydronaphthalen-2-yl)phenylsulfonamido)nicotinic acid::CHEMBL512528
SMILES: CC1(C)CCC(C)(C)c2cc(ccc12)N(c1ccc(cn1)C(O)=O)S(=O)(=O)c1ccc(Cl)cc1
InChI Key: InChIKey=HNWJYTHSCUOIGR-UHFFFAOYSA-N
Data: 3 IC50
Activity Spreadsheet -- Enzyme Inhibition Constant Data from BindingDB
Found 3 hits for monomerid = 50256176
Trg + Lig
Ki
nM
ΔG°
kcal/mole
IC50
nM
Kd
nM
EC50/IC50
nM
koff
s-1
kon
M-1s-1
pHTemp
°C
Retinoid receptor
(Homo sapiens (Human))
BDBM50256176
(6-(4-chloro-N-(5,5,8,8-tetramethyl-5,6,7,8-tetrahy...)
Show SMILES CC1(C)CCC(C)(C)c2cc(ccc12)N(c1ccc(cn1)C(O)=O)S(=O)(=O)c1ccc(Cl)cc1
Show InChI InChI=1S/C26H27ClN2O4S/c1-25(2)13-14-26(3,4)22-15-19(8-11-21(22)25)29(23-12-5-17(16-28-23)24(30)31)34(32,33)20-9-6-18(27)7-10-20/h5-12,15-16H,13-14H2,1-4H3,(H,30,31)
Reactome pathway
n/an/a 870n/an/an/an/an/an/a
Okayama University Graduate School of Medicine
Curated by ChEMBL
Assay Description
Antagonist activity at RXRbeta (unknown origin) expressed in african green monkey COS1 cells assessed as inhibition of LGD1069-induced agonist activi...
Bioorg Med Chem Lett 19: 1001-3 (2009)
Article DOI: 10.1016/j.bmcl.2008.11.086
BindingDB Entry DOI: 10.7270/Q2TH8MJW
Retinoid X receptor gamma/retinoic acid receptor alpha
(Homo sapiens (Human))
BDBM50256176
(6-(4-chloro-N-(5,5,8,8-tetramethyl-5,6,7,8-tetrahy...)
Show SMILES CC1(C)CCC(C)(C)c2cc(ccc12)N(c1ccc(cn1)C(O)=O)S(=O)(=O)c1ccc(Cl)cc1
Show InChI InChI=1S/C26H27ClN2O4S/c1-25(2)13-14-26(3,4)22-15-19(8-11-21(22)25)29(23-12-5-17(16-28-23)24(30)31)34(32,33)20-9-6-18(27)7-10-20/h5-12,15-16H,13-14H2,1-4H3,(H,30,31)
NCI pathway
Reactome pathway
n/an/a 4.50E+3n/an/an/an/an/an/a
Okayama University Graduate School of Medicine
Curated by ChEMBL
Assay Description
Antagonist activity at RXRgamma (unknown origin) expressed in african green monkey COS1 cells assessed as inhibition of LGD1069-induced agonist activ...
Bioorg Med Chem Lett 19: 1001-3 (2009)
Article DOI: 10.1016/j.bmcl.2008.11.086
BindingDB Entry DOI: 10.7270/Q2TH8MJW
Retinoic acid receptor RXR-alpha
(Homo sapiens (Human))
BDBM50256176
(6-(4-chloro-N-(5,5,8,8-tetramethyl-5,6,7,8-tetrahy...)
Show SMILES CC1(C)CCC(C)(C)c2cc(ccc12)N(c1ccc(cn1)C(O)=O)S(=O)(=O)c1ccc(Cl)cc1
Show InChI InChI=1S/C26H27ClN2O4S/c1-25(2)13-14-26(3,4)22-15-19(8-11-21(22)25)29(23-12-5-17(16-28-23)24(30)31)34(32,33)20-9-6-18(27)7-10-20/h5-12,15-16H,13-14H2,1-4H3,(H,30,31)
NCI pathway
Reactome pathway
n/an/a 4.10E+3n/an/an/an/an/an/a
Okayama University Graduate School of Medicine
Curated by ChEMBL
Assay Description
Antagonist activity at RXRalpha (unknown origin) expressed in african green monkey COS1 cells assessed as inhibition of LGD1069-induced agonist activ...
Bioorg Med Chem Lett 19: 1001-3 (2009)
Article DOI: 10.1016/j.bmcl.2008.11.086
BindingDB Entry DOI: 10.7270/Q2TH8MJW