BDBM50256355 CHEMBL4102516
SMILES: Cc1[nH]c(-c2ccccc2Oc2ccccc2)c2cn[nH]c(=O)c12
InChI Key: InChIKey=QCLURBBHYMMOOB-UHFFFAOYSA-N
Data: 1 KI  1 EC50
Activity Spreadsheet -- Enzyme Inhibition Constant Data from BindingDB
Found 2 hits for monomerid = 50256355
Trg + Lig
Ki
nM
ΔG°
kcal/mole
IC50
nM
Kd
nM
EC50/IC50
nM
koff
s-1
kon
M-1s-1
pHTemp
°C
Bromodomain-containing protein 4
(Homo sapiens (Human))
BDBM50256355
(CHEMBL4102516)
Show SMILES Cc1[nH]c(-c2ccccc2Oc2ccccc2)c2cn[nH]c(=O)c12
Show InChI InChI=1S/C19H15N3O2/c1-12-17-15(11-20-22-19(17)23)18(21-12)14-9-5-6-10-16(14)24-13-7-3-2-4-8-13/h2-11,21H,1H3,(H,22,23)
37n/an/an/an/an/an/an/an/a
AbbVie Inc., Oncology Discovery, 1 North Waukegan Rd., North Chicago, IL 60064, USA.
Curated by ChEMBL
Assay Description
Binding affinity to His-tagged BRD4 BD1-BD2 (K57 to K550 residues) (unknown origin) after 1 hr by Alexa-647-conjugated probe based TR-FRET assay
Bioorg Med Chem Lett 27: 2225-2233 (2017)
Article DOI: 10.1016/j.bmcl.2017.02.057
BindingDB Entry DOI: 10.7270/Q20P12FJ
Bromodomain-containing protein 4
(Homo sapiens (Human))
BDBM50256355
(CHEMBL4102516)
Show SMILES Cc1[nH]c(-c2ccccc2Oc2ccccc2)c2cn[nH]c(=O)c12
Show InChI InChI=1S/C19H15N3O2/c1-12-17-15(11-20-22-19(17)23)18(21-12)14-9-5-6-10-16(14)24-13-7-3-2-4-8-13/h2-11,21H,1H3,(H,22,23)
n/an/an/an/a 220n/an/an/an/a
AbbVie Inc., Oncology Discovery, 1 North Waukegan Rd., North Chicago, IL 60064, USA.
Curated by ChEMBL
Assay Description
Binding affinity to His-tagged BRD4 BD1-BD2 (K57 to K550 residues) (unknown origin) after 1 hr by Alexa-647-conjugated probe based TR-FRET assay
Bioorg Med Chem Lett 27: 2225-2233 (2017)
Article DOI: 10.1016/j.bmcl.2017.02.057
BindingDB Entry DOI: 10.7270/Q20P12FJ