null
SMILES: Cc1[nH]c(-c2cc(NS(C)(=O)=O)ccc2Oc2ccccc2)c2cn[nH]c(=O)c12
InChI Key: InChIKey=LPQIHHHQRDWFRN-UHFFFAOYSA-N
Activity Spreadsheet -- Enzyme Inhibition Constant Data from BindingDB
Found 2 hits for monomerid = 50256358
Trg + Lig
Ki
nM
ΔG°
kcal/mole
IC50
nM
Kd
nM
EC50/IC50
nM
koff
s-1
kon
M-1s-1
pHTemp
°C
Bromodomain-containing protein 4
(Homo sapiens (Human))
BDBM50256358
(CHEMBL4086135)
Show SMILES Cc1[nH]c(-c2cc(NS(C)(=O)=O)ccc2Oc2ccccc2)c2cn[nH]c(=O)c12
Show InChI InChI=1S/C20H18N4O4S/c1-12-18-16(11-21-23-20(18)25)19(22-12)15-10-13(24-29(2,26)27)8-9-17(15)28-14-6-4-3-5-7-14/h3-11,22,24H,1-2H3,(H,23,25)
30n/an/an/an/an/an/an/an/a
AbbVie Inc., Oncology Discovery, 1 North Waukegan Rd., North Chicago, IL 60064, USA.
Curated by ChEMBL
Assay Description
Binding affinity to His-tagged BRD4 BD1-BD2 (K57 to K550 residues) (unknown origin) after 1 hr by Alexa-647-conjugated probe based TR-FRET assay
Bioorg Med Chem Lett 27: 2225-2233 (2017)
Article DOI: 10.1016/j.bmcl.2017.02.057
BindingDB Entry DOI: 10.7270/Q20P12FJ
Bromodomain-containing protein 4
(Homo sapiens (Human))
BDBM50256358
(CHEMBL4086135)
Show SMILES Cc1[nH]c(-c2cc(NS(C)(=O)=O)ccc2Oc2ccccc2)c2cn[nH]c(=O)c12
Show InChI InChI=1S/C20H18N4O4S/c1-12-18-16(11-21-23-20(18)25)19(22-12)15-10-13(24-29(2,26)27)8-9-17(15)28-14-6-4-3-5-7-14/h3-11,22,24H,1-2H3,(H,23,25)
n/an/an/an/a 180n/an/an/an/a
AbbVie Inc., Oncology Discovery, 1 North Waukegan Rd., North Chicago, IL 60064, USA.
Curated by ChEMBL
Assay Description
Inhibition of BRD4 (unknown origin) expressed in human H1299 cells co-expressing HPV16-LCR/E2 after 24 hrs by Bright Glo-luciferase reporter gene ass...
Bioorg Med Chem Lett 27: 2225-2233 (2017)
Article DOI: 10.1016/j.bmcl.2017.02.057
BindingDB Entry DOI: 10.7270/Q20P12FJ