null
SMILES: CCS(=O)(=O)Nc1ccc(Oc2ccc(F)cc2)c(c1)-c1cn(C)c2c1cc[nH]c2=O
InChI Key: InChIKey=AITMUTNEKRWIEC-UHFFFAOYSA-N
Activity Spreadsheet -- Enzyme Inhibition Constant Data from BindingDB
Found 2 hits for monomerid = 50256398
Trg + Lig
Ki
nM
ΔG°
kcal/mole
IC50
nM
Kd
nM
EC50/IC50
nM
koff
s-1
kon
M-1s-1
pHTemp
°C
Bromodomain-containing protein 4
(Homo sapiens (Human))
BDBM50256398
(CHEMBL4064089)
Show SMILES CCS(=O)(=O)Nc1ccc(Oc2ccc(F)cc2)c(c1)-c1cn(C)c2c1cc[nH]c2=O
Show InChI InChI=1S/C22H20FN3O4S/c1-3-31(28,29)25-15-6-9-20(30-16-7-4-14(23)5-8-16)18(12-15)19-13-26(2)21-17(19)10-11-24-22(21)27/h4-13,25H,3H2,1-2H3,(H,24,27)
n/an/an/an/a 47n/an/an/an/a
AbbVie Inc., Oncology Discovery, 1 North Waukegan Rd., North Chicago, IL 60064, USA.
Curated by ChEMBL
Assay Description
Binding affinity to His-tagged BRD4 BD1-BD2 (K57 to K550 residues) (unknown origin) after 1 hr by Alexa-647-conjugated probe based TR-FRET assay
Bioorg Med Chem Lett 27: 2225-2233 (2017)
Article DOI: 10.1016/j.bmcl.2017.02.057
BindingDB Entry DOI: 10.7270/Q20P12FJ
Bromodomain-containing protein 4
(Homo sapiens (Human))
BDBM50256398
(CHEMBL4064089)
Show SMILES CCS(=O)(=O)Nc1ccc(Oc2ccc(F)cc2)c(c1)-c1cn(C)c2c1cc[nH]c2=O
Show InChI InChI=1S/C22H20FN3O4S/c1-3-31(28,29)25-15-6-9-20(30-16-7-4-14(23)5-8-16)18(12-15)19-13-26(2)21-17(19)10-11-24-22(21)27/h4-13,25H,3H2,1-2H3,(H,24,27)
5.5n/an/an/an/an/an/an/an/a
AbbVie Inc., Oncology Discovery, 1 North Waukegan Rd., North Chicago, IL 60064, USA.
Curated by ChEMBL
Assay Description
Binding affinity to His-tagged BRD4 BD1-BD2 (K57 to K550 residues) (unknown origin) after 1 hr by Alexa-647-conjugated probe based TR-FRET assay
Bioorg Med Chem Lett 27: 2225-2233 (2017)
Article DOI: 10.1016/j.bmcl.2017.02.057
BindingDB Entry DOI: 10.7270/Q20P12FJ