BDBM50256476 CHEMBL454796::N-(2,6-difluorophenyl)-3-(3-(2-(4-(4-((2R,6S)-2,6-dimethylmorpholino)piperidin-1-yl)-2-methoxyphenylamino)pyrimidin-4-yl)imidazo[1,2-a]pyridin-2-yl)benzamide
SMILES: COc1cc(ccc1Nc1nccc(n1)-c1c(nc2ccccn12)-c1cccc(c1)C(=O)Nc1c(F)cccc1F)N1CCC(CC1)N1C[C@H](C)O[C@H](C)C1
InChI Key: InChIKey=BOJLJYRVWHJBLQ-MKPDMIMOSA-N
Data: 2 IC50
Activity Spreadsheet -- Enzyme Inhibition Constant Data from BindingDB
Found 2 hits for monomerid = 50256476
Trg + Lig
Ki
nM
ΔG°
kcal/mole
IC50
nM
Kd
nM
EC50/IC50
nM
koff
s-1
kon
M-1s-1
pHTemp
°C
Insulin-like growth factor I receptor
(Homo sapiens (Human))
BDBM50256476
(CHEMBL454796 | N-(2,6-difluorophenyl)-3-(3-(2-(4-(...)
Show SMILES COc1cc(ccc1Nc1nccc(n1)-c1c(nc2ccccn12)-c1cccc(c1)C(=O)Nc1c(F)cccc1F)N1CCC(CC1)N1C[C@H](C)O[C@H](C)C1 |r|
Show InChI InChI=1S/C42H42F2N8O3/c1-26-24-51(25-27(2)55-26)30-16-20-50(21-17-30)31-13-14-34(36(23-31)54-3)46-42-45-18-15-35(47-42)40-38(48-37-12-4-5-19-52(37)40)28-8-6-9-29(22-28)41(53)49-39-32(43)10-7-11-33(39)44/h4-15,18-19,22-23,26-27,30H,16-17,20-21,24-25H2,1-3H3,(H,49,53)(H,45,46,47)/t26-,27+
Reactome pathway
n/an/a 68n/an/an/an/an/an/a
GlaxoSmithKline
Curated by ChEMBL
Assay Description
Inhibition of human IGF1R autophosphorylation in transfected mouse NIH3T3 cells
Bioorg Med Chem Lett 19: 1004-8 (2009)
Article DOI: 10.1016/j.bmcl.2008.11.058
BindingDB Entry DOI: 10.7270/Q24T6J8M
Insulin-like growth factor I receptor
(Homo sapiens (Human))
BDBM50256476
(CHEMBL454796 | N-(2,6-difluorophenyl)-3-(3-(2-(4-(...)
Show SMILES COc1cc(ccc1Nc1nccc(n1)-c1c(nc2ccccn12)-c1cccc(c1)C(=O)Nc1c(F)cccc1F)N1CCC(CC1)N1C[C@H](C)O[C@H](C)C1 |r|
Show InChI InChI=1S/C42H42F2N8O3/c1-26-24-51(25-27(2)55-26)30-16-20-50(21-17-30)31-13-14-34(36(23-31)54-3)46-42-45-18-15-35(47-42)40-38(48-37-12-4-5-19-52(37)40)28-8-6-9-29(22-28)41(53)49-39-32(43)10-7-11-33(39)44/h4-15,18-19,22-23,26-27,30H,16-17,20-21,24-25H2,1-3H3,(H,49,53)(H,45,46,47)/t26-,27+
Reactome pathway
n/an/a 4n/an/an/an/an/an/a
GlaxoSmithKline
Curated by ChEMBL
Assay Description
Inhibition of GST-tagged IGF1R (957-1367) (unknown origin) expressed in baculovirus by time-resolved fluorescence assay
Bioorg Med Chem Lett 19: 1004-8 (2009)
Article DOI: 10.1016/j.bmcl.2008.11.058
BindingDB Entry DOI: 10.7270/Q24T6J8M