BDBM50257081 CHEMBL4089038
SMILES: Cc1csc(NC(=O)c2cc(Oc3cncnc3)cc(C)n2)n1
InChI Key: InChIKey=SGRIDZXLXCGMAU-UHFFFAOYSA-N
Data: 2 IC50
Activity Spreadsheet -- Enzyme Inhibition Constant Data from BindingDB
Found 2 hits for monomerid = 50257081
Trg + Lig
Ki
nM
ΔG°
kcal/mole
IC50
nM
Kd
nM
EC50/IC50
nM
koff
s-1
kon
M-1s-1
pHTemp
°C
Metabotropic glutamate receptor
(Rattus norvegicus (Rat))
BDBM50257081
(CHEMBL4089038)
Show SMILES Cc1csc(NC(=O)c2cc(Oc3cncnc3)cc(C)n2)n1
Show InChI InChI=1S/C15H13N5O2S/c1-9-3-11(22-12-5-16-8-17-6-12)4-13(18-9)14(21)20-15-19-10(2)7-23-15/h3-8H,1-2H3,(H,19,20,21)
Reactome pathway
n/an/a 98n/an/an/an/an/an/a
Department of Radiology and Radiological Sciences, Vanderbilt University Institute of Imaging Science, Vanderbilt University Medical Center , Nashville, Tennessee 37232, United States.
Curated by ChEMBL
Assay Description
Negative allosteric modulation of rat mGlu5 receptor expressed in HEK293A cells assessed as inhibition of glutamate induced-calcium mobilization prei...
J Med Chem 60: 5072-5085 (2017)
Article DOI: 10.1021/acs.jmedchem.7b00410
BindingDB Entry DOI: 10.7270/Q2JH3PM7
Metabotropic glutamate receptor
(Rattus norvegicus (Rat))
BDBM50257081
(CHEMBL4089038)
Show SMILES Cc1csc(NC(=O)c2cc(Oc3cncnc3)cc(C)n2)n1
Show InChI InChI=1S/C15H13N5O2S/c1-9-3-11(22-12-5-16-8-17-6-12)4-13(18-9)14(21)20-15-19-10(2)7-23-15/h3-8H,1-2H3,(H,19,20,21)
Reactome pathway
n/an/a 98n/an/an/an/an/an/a
Department of Radiology and Radiological Sciences, Vanderbilt University Institute of Imaging Science, Vanderbilt University Medical Center , Nashville, Tennessee 37232, United States.
Curated by ChEMBL
Assay Description
Negative allosteric modulation of rat mGlu5 receptor expressed in HEK293A cells assessed as inhibition of glutamate induced-calcium mobilization prei...
J Med Chem 60: 5072-5085 (2017)
Article DOI: 10.1021/acs.jmedchem.7b00410
BindingDB Entry DOI: 10.7270/Q2JH3PM7