BDBM50257166 CHEMBL2325330
SMILES: Clc1ccc(Oc2ccc(cc2C#N)S(=O)(=O)Nc2ncns2)c(c1)-c1cn[nH]c1
InChI Key: InChIKey=REYUORGZKYONMN-UHFFFAOYSA-N
Data: 5 IC50
Activity Spreadsheet -- Enzyme Inhibition Constant Data from BindingDB
Found 5 hits for monomerid = 50257166
Trg + Lig
Ki
nM
ΔG°
kcal/mole
IC50
nM
Kd
nM
EC50/IC50
nM
koff
s-1
kon
M-1s-1
pHTemp
°C
Cytochrome P450 3A4
(Homo sapiens (Human))
BDBM50257166
(CHEMBL2325330)
Show SMILES Clc1ccc(Oc2ccc(cc2C#N)S(=O)(=O)Nc2ncns2)c(c1)-c1cn[nH]c1
Show InChI InChI=1S/C18H11ClN6O3S2/c19-13-1-3-17(15(6-13)12-8-22-23-9-12)28-16-4-2-14(5-11(16)7-20)30(26,27)25-18-21-10-24-29-18/h1-6,8-10H,(H,22,23)(H,21,24,25)
Reactome pathway
n/an/a 505n/an/an/an/an/an/a
Icagen Inc. , 4222 Emperor Blvd no. 350, Durham, North Carolina 27703, United States.
Curated by ChEMBL
Assay Description
Inhibition of CYP3A4 (unknown origin)
J Med Chem 60: 7029-7042 (2017)
Article DOI: 10.1021/acs.jmedchem.7b00598
BindingDB Entry DOI: 10.7270/Q21G0PQF
Cytochrome P450 2C9
(Homo sapiens (Human))
BDBM50257166
(CHEMBL2325330)
Show SMILES Clc1ccc(Oc2ccc(cc2C#N)S(=O)(=O)Nc2ncns2)c(c1)-c1cn[nH]c1
Show InChI InChI=1S/C18H11ClN6O3S2/c19-13-1-3-17(15(6-13)12-8-22-23-9-12)28-16-4-2-14(5-11(16)7-20)30(26,27)25-18-21-10-24-29-18/h1-6,8-10H,(H,22,23)(H,21,24,25)
Reactome pathway
n/an/a 83n/an/an/an/an/an/a
Icagen Inc. , 4222 Emperor Blvd no. 350, Durham, North Carolina 27703, United States.
Curated by ChEMBL
Assay Description
Inhibition of CYP2C9 (unknown origin)
J Med Chem 60: 7029-7042 (2017)
Article DOI: 10.1021/acs.jmedchem.7b00598
BindingDB Entry DOI: 10.7270/Q21G0PQF
Sodium channel protein type 9 subunit alpha
(Homo sapiens (Human))
BDBM50257166
(CHEMBL2325330)
Show SMILES Clc1ccc(Oc2ccc(cc2C#N)S(=O)(=O)Nc2ncns2)c(c1)-c1cn[nH]c1
Show InChI InChI=1S/C18H11ClN6O3S2/c19-13-1-3-17(15(6-13)12-8-22-23-9-12)28-16-4-2-14(5-11(16)7-20)30(26,27)25-18-21-10-24-29-18/h1-6,8-10H,(H,22,23)(H,21,24,25)
n/an/a 3.70n/an/an/an/an/an/a
AstraZeneca
Curated by ChEMBL
Assay Description
Inhibition of NaV1.7 ion channel (unknown origin)
Bioorg Med Chem Lett 23: 261-3 (2013)
Article DOI: 10.1016/j.bmcl.2012.10.102
BindingDB Entry DOI: 10.7270/Q2445QD6
Sodium channel protein type 5 subunit alpha
(Homo sapiens (Human))
BDBM50257166
(CHEMBL2325330)
Show SMILES Clc1ccc(Oc2ccc(cc2C#N)S(=O)(=O)Nc2ncns2)c(c1)-c1cn[nH]c1
Show InChI InChI=1S/C18H11ClN6O3S2/c19-13-1-3-17(15(6-13)12-8-22-23-9-12)28-16-4-2-14(5-11(16)7-20)30(26,27)25-18-21-10-24-29-18/h1-6,8-10H,(H,22,23)(H,21,24,25)
n/an/a 1.71E+4n/an/an/an/an/an/a
Icagen Inc. , 4222 Emperor Blvd no. 350, Durham, North Carolina 27703, United States.
Curated by ChEMBL
Assay Description
Inhibition of human NaV1.5 expressed in HEK cells assessed as half inactivation potential at -120 mV holding potential by automated patch clamp metho...
J Med Chem 60: 7029-7042 (2017)
Article DOI: 10.1021/acs.jmedchem.7b00598
BindingDB Entry DOI: 10.7270/Q21G0PQF
Sodium channel protein type 9 subunit alpha
(Homo sapiens (Human))
BDBM50257166
(CHEMBL2325330)
Show SMILES Clc1ccc(Oc2ccc(cc2C#N)S(=O)(=O)Nc2ncns2)c(c1)-c1cn[nH]c1
Show InChI InChI=1S/C18H11ClN6O3S2/c19-13-1-3-17(15(6-13)12-8-22-23-9-12)28-16-4-2-14(5-11(16)7-20)30(26,27)25-18-21-10-24-29-18/h1-6,8-10H,(H,22,23)(H,21,24,25)
n/an/a 4n/an/an/an/an/an/a
Icagen Inc. , 4222 Emperor Blvd no. 350, Durham, North Carolina 27703, United States.
Curated by ChEMBL
Assay Description
Inhibition of human NaV1.7 expressed in HEK cells assessed as half inactivation potential at -120 mV holding potential by automated patch clamp metho...
J Med Chem 60: 7029-7042 (2017)
Article DOI: 10.1021/acs.jmedchem.7b00598
BindingDB Entry DOI: 10.7270/Q21G0PQF