BDBM50257168 CHEMBL2325013
SMILES: Nc1cc(ccn1)-c1cc(Cl)ccc1Oc1ccc(cc1C#N)S(=O)(=O)Nc1ncns1
InChI Key: InChIKey=GGHBVUAXMMWOPA-UHFFFAOYSA-N
Data: 5 IC50
Activity Spreadsheet -- Enzyme Inhibition Constant Data from BindingDB
Found 5 hits for monomerid = 50257168
Trg + Lig
Ki
nM
ΔG°
kcal/mole
IC50
nM
Kd
nM
EC50/IC50
nM
koff
s-1
kon
M-1s-1
pHTemp
°C
Cytochrome P450 3A4
(Homo sapiens (Human))
BDBM50257168
(CHEMBL2325013)
Show SMILES Nc1cc(ccn1)-c1cc(Cl)ccc1Oc1ccc(cc1C#N)S(=O)(=O)Nc1ncns1
Show InChI InChI=1S/C20H13ClN6O3S2/c21-14-1-3-18(16(9-14)12-5-6-24-19(23)8-12)30-17-4-2-15(7-13(17)10-22)32(28,29)27-20-25-11-26-31-20/h1-9,11H,(H2,23,24)(H,25,26,27)
Reactome pathway
n/an/a 205n/an/an/an/an/an/a
Icagen Inc. , 4222 Emperor Blvd no. 350, Durham, North Carolina 27703, United States.
Curated by ChEMBL
Assay Description
Inhibition of CYP3A4 (unknown origin)
J Med Chem 60: 7029-7042 (2017)
Article DOI: 10.1021/acs.jmedchem.7b00598
BindingDB Entry DOI: 10.7270/Q21G0PQF
Cytochrome P450 2C9
(Homo sapiens (Human))
BDBM50257168
(CHEMBL2325013)
Show SMILES Nc1cc(ccn1)-c1cc(Cl)ccc1Oc1ccc(cc1C#N)S(=O)(=O)Nc1ncns1
Show InChI InChI=1S/C20H13ClN6O3S2/c21-14-1-3-18(16(9-14)12-5-6-24-19(23)8-12)30-17-4-2-15(7-13(17)10-22)32(28,29)27-20-25-11-26-31-20/h1-9,11H,(H2,23,24)(H,25,26,27)
Reactome pathway
n/an/a 279n/an/an/an/an/an/a
Icagen Inc. , 4222 Emperor Blvd no. 350, Durham, North Carolina 27703, United States.
Curated by ChEMBL
Assay Description
Inhibition of CYP2C9 (unknown origin)
J Med Chem 60: 7029-7042 (2017)
Article DOI: 10.1021/acs.jmedchem.7b00598
BindingDB Entry DOI: 10.7270/Q21G0PQF
Sodium channel protein type 9 subunit alpha
(Homo sapiens (Human))
BDBM50257168
(CHEMBL2325013)
Show SMILES Nc1cc(ccn1)-c1cc(Cl)ccc1Oc1ccc(cc1C#N)S(=O)(=O)Nc1ncns1
Show InChI InChI=1S/C20H13ClN6O3S2/c21-14-1-3-18(16(9-14)12-5-6-24-19(23)8-12)30-17-4-2-15(7-13(17)10-22)32(28,29)27-20-25-11-26-31-20/h1-9,11H,(H2,23,24)(H,25,26,27)
n/an/a 8.5n/an/an/an/an/an/a
AstraZeneca
Curated by ChEMBL
Assay Description
Inhibition of NaV1.7 ion channel (unknown origin)
Bioorg Med Chem Lett 23: 261-3 (2013)
Article DOI: 10.1016/j.bmcl.2012.10.102
BindingDB Entry DOI: 10.7270/Q2445QD6
Sodium channel protein type 9 subunit alpha
(Homo sapiens (Human))
BDBM50257168
(CHEMBL2325013)
Show SMILES Nc1cc(ccn1)-c1cc(Cl)ccc1Oc1ccc(cc1C#N)S(=O)(=O)Nc1ncns1
Show InChI InChI=1S/C20H13ClN6O3S2/c21-14-1-3-18(16(9-14)12-5-6-24-19(23)8-12)30-17-4-2-15(7-13(17)10-22)32(28,29)27-20-25-11-26-31-20/h1-9,11H,(H2,23,24)(H,25,26,27)
n/an/a 9n/an/an/an/an/an/a
Icagen Inc. , 4222 Emperor Blvd no. 350, Durham, North Carolina 27703, United States.
Curated by ChEMBL
Assay Description
Inhibition of human NaV1.7 expressed in HEK cells assessed as half inactivation potential at -120 mV holding potential by automated patch clamp metho...
J Med Chem 60: 7029-7042 (2017)
Article DOI: 10.1021/acs.jmedchem.7b00598
BindingDB Entry DOI: 10.7270/Q21G0PQF
Sodium channel protein type 5 subunit alpha
(Homo sapiens (Human))
BDBM50257168
(CHEMBL2325013)
Show SMILES Nc1cc(ccn1)-c1cc(Cl)ccc1Oc1ccc(cc1C#N)S(=O)(=O)Nc1ncns1
Show InChI InChI=1S/C20H13ClN6O3S2/c21-14-1-3-18(16(9-14)12-5-6-24-19(23)8-12)30-17-4-2-15(7-13(17)10-22)32(28,29)27-20-25-11-26-31-20/h1-9,11H,(H2,23,24)(H,25,26,27)
n/an/a>1.00E+4n/an/an/an/an/an/a
Icagen Inc. , 4222 Emperor Blvd no. 350, Durham, North Carolina 27703, United States.
Curated by ChEMBL
Assay Description
Inhibition of human NaV1.5 expressed in HEK cells assessed as half inactivation potential at -120 mV holding potential by automated patch clamp metho...
J Med Chem 60: 7029-7042 (2017)
Article DOI: 10.1021/acs.jmedchem.7b00598
BindingDB Entry DOI: 10.7270/Q21G0PQF