BDBM50257231 CHEMBL4065973
SMILES: CCCC[C@H](NC(=O)[C@@H]1CCCN1C(=O)CNC(=O)[C@H](CCCCN)NC(=O)[C@H](Cc1c[nH]cn1)NC(=O)[C@H](CO)NC(=O)[C@H](CC(C)C)N(C)C(=O)[C@H](CCCNC(N)=N)NC(=O)[C@@H]1CCCN1C(=O)[C@H](CCCNC(N)=N)NC(=O)[C@H](CCC(N)=O)NC(=O)[C@H](CCCNC(N)=N)NC(=O)[C@H](CCCNC(N)=N)NC(=O)[C@H](Cc1ccccc1)NC(=O)[C@@H](N)CCCCN)C(=O)NC(C)(C)C(=O)N[C@@H](Cc1ccc(Br)cc1)C(O)=O
InChI Key: InChIKey=KLQZDNWCYDAAMM-MOBVNWGTSA-N
Data: 1 KI  1 EC50
Activity Spreadsheet -- Enzyme Inhibition Constant Data from BindingDB
Found 4 hits for monomerid = 50257231
Trg + Lig
Ki
nM
ΔG°
kcal/mole
IC50
nM
Kd
nM
EC50/IC50
nM
koff
s-1
kon
M-1s-1
pHTemp
°C
Apelin receptor
(Rattus norvegicus)
BDBM50257231
(CHEMBL4065973)
Show SMILES CCCC[C@H](NC(=O)[C@@H]1CCCN1C(=O)CNC(=O)[C@H](CCCCN)NC(=O)[C@H](Cc1c[nH]cn1)NC(=O)[C@H](CO)NC(=O)[C@H](CC(C)C)N(C)C(=O)[C@H](CCCNC(N)=N)NC(=O)[C@@H]1CCCN1C(=O)[C@H](CCCNC(N)=N)NC(=O)[C@H](CCC(N)=O)NC(=O)[C@H](CCCNC(N)=N)NC(=O)[C@H](CCCNC(N)=N)NC(=O)[C@H](Cc1ccccc1)NC(=O)[C@@H](N)CCCCN)C(=O)NC(C)(C)C(=O)N[C@@H](Cc1ccc(Br)cc1)C(O)=O |r|
Show InChI InChI=1S/C97H159BrN34O20/c1-7-8-25-64(85(144)129-97(4,5)92(152)128-70(91(150)151)49-57-33-35-58(98)36-34-57)122-86(145)72-31-20-45-131(72)76(135)52-116-78(137)61(26-13-15-40-100)118-83(142)69(50-59-51-111-54-117-59)126-84(143)71(53-133)127-88(147)74(47-55(2)3)130(6)89(148)66(29-18-43-114-95(107)108)124-87(146)73-32-21-46-132(73)90(149)67(30-19-44-115-96(109)110)123-81(140)65(37-38-75(102)134)121-80(139)62(27-16-41-112-93(103)104)119-79(138)63(28-17-42-113-94(105)106)120-82(141)68(48-56-22-10-9-11-23-56)125-77(136)60(101)24-12-14-39-99/h9-11,22-23,33-36,51,54-55,60-74,133H,7-8,12-21,24-32,37-50,52-53,99-101H2,1-6H3,(H2,102,134)(H,111,117)(H,116,137)(H,118,142)(H,119,138)(H,120,141)(H,121,139)(H,122,145)(H,123,140)(H,124,146)(H,125,136)(H,126,143)(H,127,147)(H,128,152)(H,129,144)(H,150,151)(H4,103,104,112)(H4,105,106,113)(H4,107,108,114)(H4,109,110,115)/t60-,61-,62-,63-,64-,65-,66-,67-,68-,69-,70-,71-,72-,73-,74-/m0/s1
0.450n/an/an/an/an/an/an/an/a
Department of Chemistry, University of Alberta , 11227 Saskatchewan Drive NW, Edmonton, Alberta T6G 2G2, Canada.
Curated by ChEMBL
Assay Description
Displacement of [125I]-pyr-1-apelin-13 from rat C-terminal EGFP-tagged APJ receptor expressed in CHO cell membranes after 3 hrs by Wallac gamma count...
J Med Chem 60: 6408-6427 (2017)
Article DOI: 10.1021/acs.jmedchem.7b00723
BindingDB Entry DOI: 10.7270/Q2WS8WPC
Apelin receptor
(Homo sapiens (Human))
BDBM50257231
(CHEMBL4065973)
Show SMILES CCCC[C@H](NC(=O)[C@@H]1CCCN1C(=O)CNC(=O)[C@H](CCCCN)NC(=O)[C@H](Cc1c[nH]cn1)NC(=O)[C@H](CO)NC(=O)[C@H](CC(C)C)N(C)C(=O)[C@H](CCCNC(N)=N)NC(=O)[C@@H]1CCCN1C(=O)[C@H](CCCNC(N)=N)NC(=O)[C@H](CCC(N)=O)NC(=O)[C@H](CCCNC(N)=N)NC(=O)[C@H](CCCNC(N)=N)NC(=O)[C@H](Cc1ccccc1)NC(=O)[C@@H](N)CCCCN)C(=O)NC(C)(C)C(=O)N[C@@H](Cc1ccc(Br)cc1)C(O)=O |r|
Show InChI InChI=1S/C97H159BrN34O20/c1-7-8-25-64(85(144)129-97(4,5)92(152)128-70(91(150)151)49-57-33-35-58(98)36-34-57)122-86(145)72-31-20-45-131(72)76(135)52-116-78(137)61(26-13-15-40-100)118-83(142)69(50-59-51-111-54-117-59)126-84(143)71(53-133)127-88(147)74(47-55(2)3)130(6)89(148)66(29-18-43-114-95(107)108)124-87(146)73-32-21-46-132(73)90(149)67(30-19-44-115-96(109)110)123-81(140)65(37-38-75(102)134)121-80(139)62(27-16-41-112-93(103)104)119-79(138)63(28-17-42-113-94(105)106)120-82(141)68(48-56-22-10-9-11-23-56)125-77(136)60(101)24-12-14-39-99/h9-11,22-23,33-36,51,54-55,60-74,133H,7-8,12-21,24-32,37-50,52-53,99-101H2,1-6H3,(H2,102,134)(H,111,117)(H,116,137)(H,118,142)(H,119,138)(H,120,141)(H,121,139)(H,122,145)(H,123,140)(H,124,146)(H,125,136)(H,126,143)(H,127,147)(H,128,152)(H,129,144)(H,150,151)(H4,103,104,112)(H4,105,106,113)(H4,107,108,114)(H4,109,110,115)/t60-,61-,62-,63-,64-,65-,66-,67-,68-,69-,70-,71-,72-,73-,74-/m0/s1
Reactome pathway
n/an/an/an/a 4.90n/an/an/an/a
TBA
Citation and Details
Apelin receptor
(Rattus norvegicus)
BDBM50257231
(CHEMBL4065973)
Show SMILES CCCC[C@H](NC(=O)[C@@H]1CCCN1C(=O)CNC(=O)[C@H](CCCCN)NC(=O)[C@H](Cc1c[nH]cn1)NC(=O)[C@H](CO)NC(=O)[C@H](CC(C)C)N(C)C(=O)[C@H](CCCNC(N)=N)NC(=O)[C@@H]1CCCN1C(=O)[C@H](CCCNC(N)=N)NC(=O)[C@H](CCC(N)=O)NC(=O)[C@H](CCCNC(N)=N)NC(=O)[C@H](CCCNC(N)=N)NC(=O)[C@H](Cc1ccccc1)NC(=O)[C@@H](N)CCCCN)C(=O)NC(C)(C)C(=O)N[C@@H](Cc1ccc(Br)cc1)C(O)=O |r|
Show InChI InChI=1S/C97H159BrN34O20/c1-7-8-25-64(85(144)129-97(4,5)92(152)128-70(91(150)151)49-57-33-35-58(98)36-34-57)122-86(145)72-31-20-45-131(72)76(135)52-116-78(137)61(26-13-15-40-100)118-83(142)69(50-59-51-111-54-117-59)126-84(143)71(53-133)127-88(147)74(47-55(2)3)130(6)89(148)66(29-18-43-114-95(107)108)124-87(146)73-32-21-46-132(73)90(149)67(30-19-44-115-96(109)110)123-81(140)65(37-38-75(102)134)121-80(139)62(27-16-41-112-93(103)104)119-79(138)63(28-17-42-113-94(105)106)120-82(141)68(48-56-22-10-9-11-23-56)125-77(136)60(101)24-12-14-39-99/h9-11,22-23,33-36,51,54-55,60-74,133H,7-8,12-21,24-32,37-50,52-53,99-101H2,1-6H3,(H2,102,134)(H,111,117)(H,116,137)(H,118,142)(H,119,138)(H,120,141)(H,121,139)(H,122,145)(H,123,140)(H,124,146)(H,125,136)(H,126,143)(H,127,147)(H,128,152)(H,129,144)(H,150,151)(H4,103,104,112)(H4,105,106,113)(H4,107,108,114)(H4,109,110,115)/t60-,61-,62-,63-,64-,65-,66-,67-,68-,69-,70-,71-,72-,73-,74-/m0/s1
n/an/a 0.603n/an/an/an/an/an/a
TBA
Citation and Details
Apelin receptor
(Homo sapiens (Human))
BDBM50257231
(CHEMBL4065973)
Show SMILES CCCC[C@H](NC(=O)[C@@H]1CCCN1C(=O)CNC(=O)[C@H](CCCCN)NC(=O)[C@H](Cc1c[nH]cn1)NC(=O)[C@H](CO)NC(=O)[C@H](CC(C)C)N(C)C(=O)[C@H](CCCNC(N)=N)NC(=O)[C@@H]1CCCN1C(=O)[C@H](CCCNC(N)=N)NC(=O)[C@H](CCC(N)=O)NC(=O)[C@H](CCCNC(N)=N)NC(=O)[C@H](CCCNC(N)=N)NC(=O)[C@H](Cc1ccccc1)NC(=O)[C@@H](N)CCCCN)C(=O)NC(C)(C)C(=O)N[C@@H](Cc1ccc(Br)cc1)C(O)=O |r|
Show InChI InChI=1S/C97H159BrN34O20/c1-7-8-25-64(85(144)129-97(4,5)92(152)128-70(91(150)151)49-57-33-35-58(98)36-34-57)122-86(145)72-31-20-45-131(72)76(135)52-116-78(137)61(26-13-15-40-100)118-83(142)69(50-59-51-111-54-117-59)126-84(143)71(53-133)127-88(147)74(47-55(2)3)130(6)89(148)66(29-18-43-114-95(107)108)124-87(146)73-32-21-46-132(73)90(149)67(30-19-44-115-96(109)110)123-81(140)65(37-38-75(102)134)121-80(139)62(27-16-41-112-93(103)104)119-79(138)63(28-17-42-113-94(105)106)120-82(141)68(48-56-22-10-9-11-23-56)125-77(136)60(101)24-12-14-39-99/h9-11,22-23,33-36,51,54-55,60-74,133H,7-8,12-21,24-32,37-50,52-53,99-101H2,1-6H3,(H2,102,134)(H,111,117)(H,116,137)(H,118,142)(H,119,138)(H,120,141)(H,121,139)(H,122,145)(H,123,140)(H,124,146)(H,125,136)(H,126,143)(H,127,147)(H,128,152)(H,129,144)(H,150,151)(H4,103,104,112)(H4,105,106,113)(H4,107,108,114)(H4,109,110,115)/t60-,61-,62-,63-,64-,65-,66-,67-,68-,69-,70-,71-,72-,73-,74-/m0/s1
Reactome pathway
n/an/an/an/a 4.90n/an/an/an/a
University of Alberta
Curated by ChEMBL
Assay Description
Activation of recombinant human APJ expressed in rat Chem5 cells co-expressing Galpha15 by Calcium 6-QF dye based fluorescence assay
Eur J Med Chem 166: 119-124 (2019)
Article DOI: 10.1016/j.ejmech.2019.01.040