BDBM50257274 CHEMBL4079377
SMILES: Cc1cc(O)ccc1-c1ccc(C#N)n1C
InChI Key: InChIKey=NOUSIANUWXKIJJ-UHFFFAOYSA-N
Data: 1 IC50  2 EC50
Activity Spreadsheet -- Enzyme Inhibition Constant Data from BindingDB
Found 3 hits for monomerid = 50257274
Trg + Lig
Ki
nM
ΔG°
kcal/mole
IC50
nM
Kd
nM
EC50/IC50
nM
koff
s-1
kon
M-1s-1
pHTemp
°C
Androgen Receptor
(Homo sapiens (Human))
BDBM50257274
(CHEMBL4079377)
Show SMILES Cc1cc(O)ccc1-c1ccc(C#N)n1C
Show InChI InChI=1S/C13H12N2O/c1-9-7-11(16)4-5-12(9)13-6-3-10(8-14)15(13)2/h3-7,16H,1-2H3
NCI pathway
Reactome pathway
n/an/an/an/a 1.55E+3n/an/an/an/a
Pfizer Worldwide Research& Development , 610 Main Street, Cambridge, Massachusetts 02139, United States.
Curated by ChEMBL
Assay Description
Androgenic activity at human androgen receptor expressed in African green monkey CV-1 cells assessed as increase in interaction between VP16-fused AR...
J Med Chem 60: 6451-6457 (2017)
Article DOI: 10.1021/acs.jmedchem.7b00373
BindingDB Entry DOI: 10.7270/Q2HH6NH9
Androgen receptor/Baculoviral IAP repeat-containing protein 2
(Homo sapiens (Human))
BDBM50257274
(CHEMBL4079377)
Show SMILES Cc1cc(O)ccc1-c1ccc(C#N)n1C
Show InChI InChI=1S/C13H12N2O/c1-9-7-11(16)4-5-12(9)13-6-3-10(8-14)15(13)2/h3-7,16H,1-2H3
NCI pathway
Reactome pathway
n/an/a 3.70n/an/an/an/an/an/a
Pfizer Worldwide Research& Development , 610 Main Street, Cambridge, Massachusetts 02139, United States.
Curated by ChEMBL
Assay Description
Displacement of [3H]mibolerone from human androgen receptor expressed in African green monkey COS cells after 3.5 hrs by scintillation and luminescen...
J Med Chem 60: 6451-6457 (2017)
Article DOI: 10.1021/acs.jmedchem.7b00373
BindingDB Entry DOI: 10.7270/Q2HH6NH9
Androgen receptor/Baculoviral IAP repeat-containing protein 2
(Homo sapiens (Human))
BDBM50257274
(CHEMBL4079377)
Show SMILES Cc1cc(O)ccc1-c1ccc(C#N)n1C
Show InChI InChI=1S/C13H12N2O/c1-9-7-11(16)4-5-12(9)13-6-3-10(8-14)15(13)2/h3-7,16H,1-2H3
NCI pathway
Reactome pathway
n/an/an/an/a 95n/an/an/an/a
Pfizer Worldwide Research& Development , 610 Main Street, Cambridge, Massachusetts 02139, United States.
Curated by ChEMBL
Assay Description
Agonist activity at human androgen receptor expressed in African green monkey CV-1 cells after 17 hrs by ARE luciferase reporter gene assay
J Med Chem 60: 6451-6457 (2017)
Article DOI: 10.1021/acs.jmedchem.7b00373
BindingDB Entry DOI: 10.7270/Q2HH6NH9