BDBM50257329 CHEMBL4064232
SMILES: COCCn1c(CNc2cccc(c2)C(=O)NCc2ccccc2)nnc1-c1ccncc1
InChI Key: InChIKey=VPSTUMWWEPHXGY-UHFFFAOYSA-N
Data: 3 IC50  1 EC50
Activity Spreadsheet -- Enzyme Inhibition Constant Data from BindingDB
Found 4 hits for monomerid = 50257329
Trg + Lig
Ki
nM
ΔG°
kcal/mole
IC50
nM
Kd
nM
EC50/IC50
nM
koff
s-1
kon
M-1s-1
pHTemp
°C
Beta-adrenergic receptor kinase 1
(Homo sapiens (Human))
BDBM50257329
(CHEMBL4064232)
Show SMILES COCCn1c(CNc2cccc(c2)C(=O)NCc2ccccc2)nnc1-c1ccncc1
Show InChI InChI=1S/C25H26N6O2/c1-33-15-14-31-23(29-30-24(31)20-10-12-26-13-11-20)18-27-22-9-5-8-21(16-22)25(32)28-17-19-6-3-2-4-7-19/h2-13,16,27H,14-15,17-18H2,1H3,(H,28,32)
Reactome pathway
n/an/a 16n/an/an/an/an/an/a
Shonan Research Center, Pharmaceutical Research Division, Takeda Pharmaceutical Co., Ltd. , 26-1, Muraoka-Higashi 2-Chome, Fujisawa, Kanagawa 251-8555, Japan.
Curated by ChEMBL
Assay Description
Inhibition of human GRK2 expressed in HEK-B2 cells assessed as isoproterenol-stimulated cAMP accumulation preincubation for 20 mins followed by isopr...
J Med Chem 60: 6942-6990 (2017)
Article DOI: 10.1021/acs.jmedchem.7b00443
BindingDB Entry DOI: 10.7270/Q280552Z
G-protein coupled receptor kinase 2
(Homo sapiens (Human))
BDBM50257329
(CHEMBL4064232)
Show SMILES COCCn1c(CNc2cccc(c2)C(=O)NCc2ccccc2)nnc1-c1ccncc1
Show InChI InChI=1S/C25H26N6O2/c1-33-15-14-31-23(29-30-24(31)20-10-12-26-13-11-20)18-27-22-9-5-8-21(16-22)25(32)28-17-19-6-3-2-4-7-19/h2-13,16,27H,14-15,17-18H2,1H3,(H,28,32)
Reactome pathway
n/an/an/an/a 4.50E+4n/an/an/an/a
Shonan Research Center, Pharmaceutical Research Division, Takeda Pharmaceutical Co., Ltd. , 26-1, Muraoka-Higashi 2-Chome, Fujisawa, Kanagawa 251-8555, Japan.
Curated by ChEMBL
Assay Description
Inhibition of human GRK2 expressed in HEK-B2 cells assessed as isoproterenol-stimulated cAMP accumulation preincubation for 20 mins followed by isopr...
J Med Chem 60: 6942-6990 (2017)
Article DOI: 10.1021/acs.jmedchem.7b00443
BindingDB Entry DOI: 10.7270/Q280552Z
PKC alpha and beta-2
(Homo sapiens (Human))
BDBM50257329
(CHEMBL4064232)
Show SMILES COCCn1c(CNc2cccc(c2)C(=O)NCc2ccccc2)nnc1-c1ccncc1
Show InChI InChI=1S/C25H26N6O2/c1-33-15-14-31-23(29-30-24(31)20-10-12-26-13-11-20)18-27-22-9-5-8-21(16-22)25(32)28-17-19-6-3-2-4-7-19/h2-13,16,27H,14-15,17-18H2,1H3,(H,28,32)
NCI pathway
Reactome pathway
n/an/a 7.40E+3n/an/an/an/an/an/a
Shonan Research Center, Pharmaceutical Research Division, Takeda Pharmaceutical Co., Ltd. , 26-1, Muraoka-Higashi 2-Chome, Fujisawa, Kanagawa 251-8555, Japan.
Curated by ChEMBL
Assay Description
Inhibition of human PKCalpha active using MBP as substrate after 60 mins in presence of [gamma-32]ATP by scintillation counting
J Med Chem 60: 6942-6990 (2017)
Article DOI: 10.1021/acs.jmedchem.7b00443
BindingDB Entry DOI: 10.7270/Q280552Z
Rho-associated protein kinase 2
(Homo sapiens (Human))
BDBM50257329
(CHEMBL4064232)
Show SMILES COCCn1c(CNc2cccc(c2)C(=O)NCc2ccccc2)nnc1-c1ccncc1
Show InChI InChI=1S/C25H26N6O2/c1-33-15-14-31-23(29-30-24(31)20-10-12-26-13-11-20)18-27-22-9-5-8-21(16-22)25(32)28-17-19-6-3-2-4-7-19/h2-13,16,27H,14-15,17-18H2,1H3,(H,28,32)
n/an/a 320n/an/an/an/an/an/a
Shonan Research Center, Pharmaceutical Research Division, Takeda Pharmaceutical Co., Ltd. , 26-1, Muraoka-Higashi 2-Chome, Fujisawa, Kanagawa 251-8555, Japan.
Curated by ChEMBL
Assay Description
Inhibition of recombinant human N-terminal GST-tagged ROCK2 catalytic domain (1 to 553 residues) expressed in baculovirus expression system using STK...
J Med Chem 60: 6942-6990 (2017)
Article DOI: 10.1021/acs.jmedchem.7b00443
BindingDB Entry DOI: 10.7270/Q280552Z