BDBM50257351 CHEMBL4095595
SMILES: CNC(=O)c1cccc(NCc2nc(n[nH]2)-c2ccncc2)c1
InChI Key: InChIKey=MSYSXAOSMCNJKL-UHFFFAOYSA-N
Data: 8 IC50
Activity Spreadsheet -- Enzyme Inhibition Constant Data from BindingDB
Found 8 hits for monomerid = 50257351
Trg + Lig
Ki
nM
ΔG°
kcal/mole
IC50
nM
Kd
nM
EC50/IC50
nM
koff
s-1
kon
M-1s-1
pHTemp
°C
Beta-adrenergic receptor kinase 2
(Homo sapiens (Human))
BDBM50257351
(CHEMBL4095595)
Show SMILES CNC(=O)c1cccc(NCc2nc(n[nH]2)-c2ccncc2)c1
Show InChI InChI=1S/C16H16N6O/c1-17-16(23)12-3-2-4-13(9-12)19-10-14-20-15(22-21-14)11-5-7-18-8-6-11/h2-9,19H,10H2,1H3,(H,17,23)(H,20,21,22)
NCI pathway
n/an/a 21n/an/an/an/an/an/a
Shonan Research Center, Pharmaceutical Research Division, Takeda Pharmaceutical Co., Ltd. , 26-1, Muraoka-Higashi 2-Chome, Fujisawa, Kanagawa 251-8555, Japan.
Curated by ChEMBL
Assay Description
Inhibition of recombinant human full length GST-tagged GRK3 expressed in baculovirus using ulight topo2alpha as substrate preincubated for 60 mins fo...
J Med Chem 60: 6942-6990 (2017)
Article DOI: 10.1021/acs.jmedchem.7b00443
BindingDB Entry DOI: 10.7270/Q280552Z
G protein-coupled receptor kinase 5
(Homo sapiens (Human))
BDBM50257351
(CHEMBL4095595)
Show SMILES CNC(=O)c1cccc(NCc2nc(n[nH]2)-c2ccncc2)c1
Show InChI InChI=1S/C16H16N6O/c1-17-16(23)12-3-2-4-13(9-12)19-10-14-20-15(22-21-14)11-5-7-18-8-6-11/h2-9,19H,10H2,1H3,(H,17,23)(H,20,21,22)
NCI pathway
Reactome pathway
n/an/a>3.00E+4n/an/an/an/an/an/a
Shonan Research Center, Pharmaceutical Research Division, Takeda Pharmaceutical Co., Ltd. , 26-1, Muraoka-Higashi 2-Chome, Fujisawa, Kanagawa 251-8555, Japan.
Curated by ChEMBL
Assay Description
Inhibition of recombinant human full length GST-tagged GRK5 expressed in baculovirus using ulight topo2alpha as substrate preincubated for 60 mins fo...
J Med Chem 60: 6942-6990 (2017)
Article DOI: 10.1021/acs.jmedchem.7b00443
BindingDB Entry DOI: 10.7270/Q280552Z
G protein-coupled receptor kinase 7
(Homo sapiens (Human))
BDBM50257351
(CHEMBL4095595)
Show SMILES CNC(=O)c1cccc(NCc2nc(n[nH]2)-c2ccncc2)c1
Show InChI InChI=1S/C16H16N6O/c1-17-16(23)12-3-2-4-13(9-12)19-10-14-20-15(22-21-14)11-5-7-18-8-6-11/h2-9,19H,10H2,1H3,(H,17,23)(H,20,21,22)
NCI pathway
n/an/a>3.00E+4n/an/an/an/an/an/a
Shonan Research Center, Pharmaceutical Research Division, Takeda Pharmaceutical Co., Ltd. , 26-1, Muraoka-Higashi 2-Chome, Fujisawa, Kanagawa 251-8555, Japan.
Curated by ChEMBL
Assay Description
Inhibition of recombinant human full length GST-tagged GRK7 expressed in baculovirus using ulight topo2alpha as substrate preincubated for 60 mins fo...
J Med Chem 60: 6942-6990 (2017)
Article DOI: 10.1021/acs.jmedchem.7b00443
BindingDB Entry DOI: 10.7270/Q280552Z
Rhodopsin kinase
(Homo sapiens (Human))
BDBM50257351
(CHEMBL4095595)
Show SMILES CNC(=O)c1cccc(NCc2nc(n[nH]2)-c2ccncc2)c1
Show InChI InChI=1S/C16H16N6O/c1-17-16(23)12-3-2-4-13(9-12)19-10-14-20-15(22-21-14)11-5-7-18-8-6-11/h2-9,19H,10H2,1H3,(H,17,23)(H,20,21,22)
NCI pathway
Reactome pathway
n/an/a>3.00E+4n/an/an/an/an/an/a
Shonan Research Center, Pharmaceutical Research Division, Takeda Pharmaceutical Co., Ltd. , 26-1, Muraoka-Higashi 2-Chome, Fujisawa, Kanagawa 251-8555, Japan.
Curated by ChEMBL
Assay Description
Inhibition of recombinant human GST-tagged GRK1 expressed in baculovirus infected fall armyworm Sf9 cells after 60 mins by LanthaScreen eu kinase bin...
J Med Chem 60: 6942-6990 (2017)
Article DOI: 10.1021/acs.jmedchem.7b00443
BindingDB Entry DOI: 10.7270/Q280552Z
Rho-associated protein kinase 2
(Homo sapiens (Human))
BDBM50257351
(CHEMBL4095595)
Show SMILES CNC(=O)c1cccc(NCc2nc(n[nH]2)-c2ccncc2)c1
Show InChI InChI=1S/C16H16N6O/c1-17-16(23)12-3-2-4-13(9-12)19-10-14-20-15(22-21-14)11-5-7-18-8-6-11/h2-9,19H,10H2,1H3,(H,17,23)(H,20,21,22)
n/an/a 220n/an/an/an/an/an/a
Shonan Research Center, Pharmaceutical Research Division, Takeda Pharmaceutical Co., Ltd. , 26-1, Muraoka-Higashi 2-Chome, Fujisawa, Kanagawa 251-8555, Japan.
Curated by ChEMBL
Assay Description
Inhibition of recombinant human N-terminal GST-tagged ROCK2 catalytic domain (1 to 553 residues) expressed in baculovirus expression system using STK...
J Med Chem 60: 6942-6990 (2017)
Article DOI: 10.1021/acs.jmedchem.7b00443
BindingDB Entry DOI: 10.7270/Q280552Z
Beta-adrenergic receptor kinase 1
(Homo sapiens (Human))
BDBM50257351
(CHEMBL4095595)
Show SMILES CNC(=O)c1cccc(NCc2nc(n[nH]2)-c2ccncc2)c1
Show InChI InChI=1S/C16H16N6O/c1-17-16(23)12-3-2-4-13(9-12)19-10-14-20-15(22-21-14)11-5-7-18-8-6-11/h2-9,19H,10H2,1H3,(H,17,23)(H,20,21,22)
Reactome pathway
n/an/a 65n/an/an/an/an/an/a
Shonan Research Center, Pharmaceutical Research Division, Takeda Pharmaceutical Co., Ltd. , 26-1, Muraoka-Higashi 2-Chome, Fujisawa, Kanagawa 251-8555, Japan.
Curated by ChEMBL
Assay Description
Inhibition of human GRK2 expressed in HEK-B2 cells assessed as isoproterenol-stimulated cAMP accumulation preincubation for 20 mins followed by isopr...
J Med Chem 60: 6942-6990 (2017)
Article DOI: 10.1021/acs.jmedchem.7b00443
BindingDB Entry DOI: 10.7270/Q280552Z
G protein-coupled receptor kinase 6
(Homo sapiens (Human))
BDBM50257351
(CHEMBL4095595)
Show SMILES CNC(=O)c1cccc(NCc2nc(n[nH]2)-c2ccncc2)c1
Show InChI InChI=1S/C16H16N6O/c1-17-16(23)12-3-2-4-13(9-12)19-10-14-20-15(22-21-14)11-5-7-18-8-6-11/h2-9,19H,10H2,1H3,(H,17,23)(H,20,21,22)
NCI pathway
n/an/a>3.00E+4n/an/an/an/an/an/a
Shonan Research Center, Pharmaceutical Research Division, Takeda Pharmaceutical Co., Ltd. , 26-1, Muraoka-Higashi 2-Chome, Fujisawa, Kanagawa 251-8555, Japan.
Curated by ChEMBL
Assay Description
Inhibition of recombinant human full length GST-tagged GRK6 expressed in baculovirus using ulight topo2alpha as substrate preincubated for 60 mins fo...
J Med Chem 60: 6942-6990 (2017)
Article DOI: 10.1021/acs.jmedchem.7b00443
BindingDB Entry DOI: 10.7270/Q280552Z
PKC alpha and beta-2
(Homo sapiens (Human))
BDBM50257351
(CHEMBL4095595)
Show SMILES CNC(=O)c1cccc(NCc2nc(n[nH]2)-c2ccncc2)c1
Show InChI InChI=1S/C16H16N6O/c1-17-16(23)12-3-2-4-13(9-12)19-10-14-20-15(22-21-14)11-5-7-18-8-6-11/h2-9,19H,10H2,1H3,(H,17,23)(H,20,21,22)
NCI pathway
Reactome pathway
n/an/a>1.00E+4n/an/an/an/an/an/a
Shonan Research Center, Pharmaceutical Research Division, Takeda Pharmaceutical Co., Ltd. , 26-1, Muraoka-Higashi 2-Chome, Fujisawa, Kanagawa 251-8555, Japan.
Curated by ChEMBL
Assay Description
Inhibition of human PKCalpha active using MBP as substrate after 60 mins in presence of [gamma-32]ATP by scintillation counting
J Med Chem 60: 6942-6990 (2017)
Article DOI: 10.1021/acs.jmedchem.7b00443
BindingDB Entry DOI: 10.7270/Q280552Z