BDBM50257370 CHEMBL4062560
SMILES: Clc1ccc(NCc2nc(n[nH]2)-c2ccncc2)cc1
InChI Key: InChIKey=LNHMXIAOIPMUFG-UHFFFAOYSA-N
Data: 3 IC50
Activity Spreadsheet -- Enzyme Inhibition Constant Data from BindingDB
Found 3 hits for monomerid = 50257370
Trg + Lig
Ki
nM
ΔG°
kcal/mole
IC50
nM
Kd
nM
EC50/IC50
nM
koff
s-1
kon
M-1s-1
pHTemp
°C
PKC alpha and beta-2
(Homo sapiens (Human))
BDBM50257370
(CHEMBL4062560)
Show SMILES Clc1ccc(NCc2nc(n[nH]2)-c2ccncc2)cc1
Show InChI InChI=1S/C14H12ClN5/c15-11-1-3-12(4-2-11)17-9-13-18-14(20-19-13)10-5-7-16-8-6-10/h1-8,17H,9H2,(H,18,19,20)
NCI pathway
Reactome pathway
n/an/a>1.00E+4n/an/an/an/an/an/a
Shonan Research Center, Pharmaceutical Research Division, Takeda Pharmaceutical Co., Ltd. , 26-1, Muraoka-Higashi 2-Chome, Fujisawa, Kanagawa 251-8555, Japan.
Curated by ChEMBL
Assay Description
Inhibition of human PKCalpha active using MBP as substrate after 60 mins in presence of [gamma-32]ATP by scintillation counting
J Med Chem 60: 6942-6990 (2017)
Article DOI: 10.1021/acs.jmedchem.7b00443
BindingDB Entry DOI: 10.7270/Q280552Z
Rho-associated protein kinase 2
(Homo sapiens (Human))
BDBM50257370
(CHEMBL4062560)
Show SMILES Clc1ccc(NCc2nc(n[nH]2)-c2ccncc2)cc1
Show InChI InChI=1S/C14H12ClN5/c15-11-1-3-12(4-2-11)17-9-13-18-14(20-19-13)10-5-7-16-8-6-10/h1-8,17H,9H2,(H,18,19,20)
n/an/a 94n/an/an/an/an/an/a
Shonan Research Center, Pharmaceutical Research Division, Takeda Pharmaceutical Co., Ltd. , 26-1, Muraoka-Higashi 2-Chome, Fujisawa, Kanagawa 251-8555, Japan.
Curated by ChEMBL
Assay Description
Inhibition of recombinant human N-terminal GST-tagged ROCK2 catalytic domain (1 to 553 residues) expressed in baculovirus expression system using STK...
J Med Chem 60: 6942-6990 (2017)
Article DOI: 10.1021/acs.jmedchem.7b00443
BindingDB Entry DOI: 10.7270/Q280552Z
Beta-adrenergic receptor kinase 1
(Homo sapiens (Human))
BDBM50257370
(CHEMBL4062560)
Show SMILES Clc1ccc(NCc2nc(n[nH]2)-c2ccncc2)cc1
Show InChI InChI=1S/C14H12ClN5/c15-11-1-3-12(4-2-11)17-9-13-18-14(20-19-13)10-5-7-16-8-6-10/h1-8,17H,9H2,(H,18,19,20)
Reactome pathway
n/an/a 41n/an/an/an/an/an/a
Shonan Research Center, Pharmaceutical Research Division, Takeda Pharmaceutical Co., Ltd. , 26-1, Muraoka-Higashi 2-Chome, Fujisawa, Kanagawa 251-8555, Japan.
Curated by ChEMBL
Assay Description
Inhibition of human GRK2 expressed in HEK-B2 cells assessed as isoproterenol-stimulated cAMP accumulation preincubation for 20 mins followed by isopr...
J Med Chem 60: 6942-6990 (2017)
Article DOI: 10.1021/acs.jmedchem.7b00443
BindingDB Entry DOI: 10.7270/Q280552Z