BDBM50257428 CHEMBL4075992
SMILES: COc1ccccc1CNC(=O)c1cccc(NCc2nnc(-c3ccncc3)n2C)c1
InChI Key: InChIKey=RHFRJOMKPVPGGP-UHFFFAOYSA-N
Data: 3 IC50
Activity Spreadsheet -- Enzyme Inhibition Constant Data from BindingDB
Found 3 hits for monomerid = 50257428
Trg + Lig
Ki
nM
ΔG°
kcal/mole
IC50
nM
Kd
nM
EC50/IC50
nM
koff
s-1
kon
M-1s-1
pHTemp
°C
PKC alpha and beta-2
(Homo sapiens (Human))
BDBM50257428
(CHEMBL4075992)
Show SMILES COc1ccccc1CNC(=O)c1cccc(NCc2nnc(-c3ccncc3)n2C)c1
Show InChI InChI=1S/C24H24N6O2/c1-30-22(28-29-23(30)17-10-12-25-13-11-17)16-26-20-8-5-7-18(14-20)24(31)27-15-19-6-3-4-9-21(19)32-2/h3-14,26H,15-16H2,1-2H3,(H,27,31)
NCI pathway
Reactome pathway
n/an/a>1.00E+4n/an/an/an/an/an/a
Shonan Research Center, Pharmaceutical Research Division, Takeda Pharmaceutical Co., Ltd. , 26-1, Muraoka-Higashi 2-Chome, Fujisawa, Kanagawa 251-8555, Japan.
Curated by ChEMBL
Assay Description
Inhibition of human PKCalpha active using MBP as substrate after 60 mins in presence of [gamma-32]ATP by scintillation counting
J Med Chem 60: 6942-6990 (2017)
Article DOI: 10.1021/acs.jmedchem.7b00443
BindingDB Entry DOI: 10.7270/Q280552Z
Rho-associated protein kinase 2
(Homo sapiens (Human))
BDBM50257428
(CHEMBL4075992)
Show SMILES COc1ccccc1CNC(=O)c1cccc(NCc2nnc(-c3ccncc3)n2C)c1
Show InChI InChI=1S/C24H24N6O2/c1-30-22(28-29-23(30)17-10-12-25-13-11-17)16-26-20-8-5-7-18(14-20)24(31)27-15-19-6-3-4-9-21(19)32-2/h3-14,26H,15-16H2,1-2H3,(H,27,31)
n/an/a 1.60E+3n/an/an/an/an/an/a
Shonan Research Center, Pharmaceutical Research Division, Takeda Pharmaceutical Co., Ltd. , 26-1, Muraoka-Higashi 2-Chome, Fujisawa, Kanagawa 251-8555, Japan.
Curated by ChEMBL
Assay Description
Inhibition of recombinant human N-terminal GST-tagged ROCK2 catalytic domain (1 to 553 residues) expressed in baculovirus expression system using STK...
J Med Chem 60: 6942-6990 (2017)
Article DOI: 10.1021/acs.jmedchem.7b00443
BindingDB Entry DOI: 10.7270/Q280552Z
Beta-adrenergic receptor kinase 1
(Homo sapiens (Human))
BDBM50257428
(CHEMBL4075992)
Show SMILES COc1ccccc1CNC(=O)c1cccc(NCc2nnc(-c3ccncc3)n2C)c1
Show InChI InChI=1S/C24H24N6O2/c1-30-22(28-29-23(30)17-10-12-25-13-11-17)16-26-20-8-5-7-18(14-20)24(31)27-15-19-6-3-4-9-21(19)32-2/h3-14,26H,15-16H2,1-2H3,(H,27,31)
Reactome pathway
n/an/a 44n/an/an/an/an/an/a
Shonan Research Center, Pharmaceutical Research Division, Takeda Pharmaceutical Co., Ltd. , 26-1, Muraoka-Higashi 2-Chome, Fujisawa, Kanagawa 251-8555, Japan.
Curated by ChEMBL
Assay Description
Inhibition of human GRK2 expressed in HEK-B2 cells assessed as isoproterenol-stimulated cAMP accumulation preincubation for 20 mins followed by isopr...
J Med Chem 60: 6942-6990 (2017)
Article DOI: 10.1021/acs.jmedchem.7b00443
BindingDB Entry DOI: 10.7270/Q280552Z