BDBM50257446 CHEMBL4091573
SMILES: Cn1c(CNc2cccc(c2)C(=O)NCc2cccc(c2)C(F)(F)F)nnc1-c1ccncc1
InChI Key: InChIKey=VZALQQCVHAISSG-UHFFFAOYSA-N
Data: 3 IC50  1 EC50
Activity Spreadsheet -- Enzyme Inhibition Constant Data from BindingDB
Found 4 hits for monomerid = 50257446
Trg + Lig
Ki
nM
ΔG°
kcal/mole
IC50
nM
Kd
nM
EC50/IC50
nM
koff
s-1
kon
M-1s-1
pHTemp
°C
Beta-adrenergic receptor kinase 1
(Homo sapiens (Human))
BDBM50257446
(CHEMBL4091573)
Show SMILES Cn1c(CNc2cccc(c2)C(=O)NCc2cccc(c2)C(F)(F)F)nnc1-c1ccncc1
Show InChI InChI=1S/C24H21F3N6O/c1-33-21(31-32-22(33)17-8-10-28-11-9-17)15-29-20-7-3-5-18(13-20)23(34)30-14-16-4-2-6-19(12-16)24(25,26)27/h2-13,29H,14-15H2,1H3,(H,30,34)
Reactome pathway
n/an/a 39n/an/an/an/an/an/a
Shonan Research Center, Pharmaceutical Research Division, Takeda Pharmaceutical Co., Ltd. , 26-1, Muraoka-Higashi 2-Chome, Fujisawa, Kanagawa 251-8555, Japan.
Curated by ChEMBL
Assay Description
Inhibition of human GRK2 expressed in HEK-B2 cells assessed as isoproterenol-stimulated cAMP accumulation preincubation for 20 mins followed by isopr...
J Med Chem 60: 6942-6990 (2017)
Article DOI: 10.1021/acs.jmedchem.7b00443
BindingDB Entry DOI: 10.7270/Q280552Z
G-protein coupled receptor kinase 2
(Homo sapiens (Human))
BDBM50257446
(CHEMBL4091573)
Show SMILES Cn1c(CNc2cccc(c2)C(=O)NCc2cccc(c2)C(F)(F)F)nnc1-c1ccncc1
Show InChI InChI=1S/C24H21F3N6O/c1-33-21(31-32-22(33)17-8-10-28-11-9-17)15-29-20-7-3-5-18(13-20)23(34)30-14-16-4-2-6-19(12-16)24(25,26)27/h2-13,29H,14-15H2,1H3,(H,30,34)
Reactome pathway
n/an/an/an/a 2.20E+5n/an/an/an/a
Shonan Research Center, Pharmaceutical Research Division, Takeda Pharmaceutical Co., Ltd. , 26-1, Muraoka-Higashi 2-Chome, Fujisawa, Kanagawa 251-8555, Japan.
Curated by ChEMBL
Assay Description
Inhibition of human GRK2 expressed in HEK-B2 cells assessed as isoproterenol-stimulated cAMP accumulation preincubation for 20 mins followed by isopr...
J Med Chem 60: 6942-6990 (2017)
Article DOI: 10.1021/acs.jmedchem.7b00443
BindingDB Entry DOI: 10.7270/Q280552Z
PKC alpha and beta-2
(Homo sapiens (Human))
BDBM50257446
(CHEMBL4091573)
Show SMILES Cn1c(CNc2cccc(c2)C(=O)NCc2cccc(c2)C(F)(F)F)nnc1-c1ccncc1
Show InChI InChI=1S/C24H21F3N6O/c1-33-21(31-32-22(33)17-8-10-28-11-9-17)15-29-20-7-3-5-18(13-20)23(34)30-14-16-4-2-6-19(12-16)24(25,26)27/h2-13,29H,14-15H2,1H3,(H,30,34)
NCI pathway
Reactome pathway
n/an/a>1.00E+4n/an/an/an/an/an/a
Shonan Research Center, Pharmaceutical Research Division, Takeda Pharmaceutical Co., Ltd. , 26-1, Muraoka-Higashi 2-Chome, Fujisawa, Kanagawa 251-8555, Japan.
Curated by ChEMBL
Assay Description
Inhibition of human PKCalpha active using MBP as substrate after 60 mins in presence of [gamma-32]ATP by scintillation counting
J Med Chem 60: 6942-6990 (2017)
Article DOI: 10.1021/acs.jmedchem.7b00443
BindingDB Entry DOI: 10.7270/Q280552Z
Rho-associated protein kinase 2
(Homo sapiens (Human))
BDBM50257446
(CHEMBL4091573)
Show SMILES Cn1c(CNc2cccc(c2)C(=O)NCc2cccc(c2)C(F)(F)F)nnc1-c1ccncc1
Show InChI InChI=1S/C24H21F3N6O/c1-33-21(31-32-22(33)17-8-10-28-11-9-17)15-29-20-7-3-5-18(13-20)23(34)30-14-16-4-2-6-19(12-16)24(25,26)27/h2-13,29H,14-15H2,1H3,(H,30,34)
n/an/a 530n/an/an/an/an/an/a
Shonan Research Center, Pharmaceutical Research Division, Takeda Pharmaceutical Co., Ltd. , 26-1, Muraoka-Higashi 2-Chome, Fujisawa, Kanagawa 251-8555, Japan.
Curated by ChEMBL
Assay Description
Inhibition of recombinant human N-terminal GST-tagged ROCK2 catalytic domain (1 to 553 residues) expressed in baculovirus expression system using STK...
J Med Chem 60: 6942-6990 (2017)
Article DOI: 10.1021/acs.jmedchem.7b00443
BindingDB Entry DOI: 10.7270/Q280552Z