null
SMILES: Fc1ccccc1NS(=O)(=O)c1ccc2CCNCCc2c1
InChI Key: InChIKey=QHWXSLUJCJOQFF-UHFFFAOYSA-N
Activity Spreadsheet -- Enzyme Inhibition Constant Data from BindingDB
Found 3 hits for monomerid = 50257611
Trg + Lig
Ki
nM
ΔG°
kcal/mole
IC50
nM
Kd
nM
EC50/IC50
nM
koff
s-1
kon
M-1s-1
pHTemp
°C
5-hydroxytryptamine receptor 2C
(Homo sapiens (Human))
BDBM50257611
(CHEMBL522349 | N-(2-fluorophenyl)-2,3,4,5-tetrahyd...)
Show SMILES Fc1ccccc1NS(=O)(=O)c1ccc2CCNCCc2c1
Show InChI InChI=1S/C16H17FN2O2S/c17-15-3-1-2-4-16(15)19-22(20,21)14-6-5-12-7-9-18-10-8-13(12)11-14/h1-6,11,18-19H,7-10H2
Reactome pathway
133n/an/an/an/an/an/an/an/a
Pfizer Global Research and Development
Curated by ChEMBL
Assay Description
Displacement of [3H]mesulergine form human recombinant 5HT2C receptor expressed in mouse Swiss 3T3 cells by scintillation proximity assay
Bioorg Med Chem Lett 19: 1871-5 (2009)
Article DOI: 10.1016/j.bmcl.2009.02.071
BindingDB Entry DOI: 10.7270/Q2GB23XH
5-hydroxytryptamine receptor 2C
(Homo sapiens (Human))
BDBM50257611
(CHEMBL522349 | N-(2-fluorophenyl)-2,3,4,5-tetrahyd...)
Show SMILES Fc1ccccc1NS(=O)(=O)c1ccc2CCNCCc2c1
Show InChI InChI=1S/C16H17FN2O2S/c17-15-3-1-2-4-16(15)19-22(20,21)14-6-5-12-7-9-18-10-8-13(12)11-14/h1-6,11,18-19H,7-10H2
Reactome pathway
n/an/an/an/a 197n/an/an/an/a
Pfizer Global Research and Development
Curated by ChEMBL
Assay Description
Agonist activity at human recombinant 5HT2C receptor expressed in CHOK1 cells assessed as calcium mobilization by FLIPR assay
Bioorg Med Chem Lett 19: 1871-5 (2009)
Article DOI: 10.1016/j.bmcl.2009.02.071
BindingDB Entry DOI: 10.7270/Q2GB23XH
5-hydroxytryptamine receptor 2B
(Homo sapiens (Human))
BDBM50257611
(CHEMBL522349 | N-(2-fluorophenyl)-2,3,4,5-tetrahyd...)
Show SMILES Fc1ccccc1NS(=O)(=O)c1ccc2CCNCCc2c1
Show InChI InChI=1S/C16H17FN2O2S/c17-15-3-1-2-4-16(15)19-22(20,21)14-6-5-12-7-9-18-10-8-13(12)11-14/h1-6,11,18-19H,7-10H2
Reactome pathway
n/an/an/an/a 75n/an/an/an/a
Pfizer Global Research and Development
Curated by ChEMBL
Assay Description
Agonist activity at human recombinant 5HT2B receptor by cell-based system
Bioorg Med Chem Lett 19: 1871-5 (2009)
Article DOI: 10.1016/j.bmcl.2009.02.071
BindingDB Entry DOI: 10.7270/Q2GB23XH